Re: PHP on HP-UX Itanium 2

From: Date: Thu, 09 Oct 2003 20:26:59 +0000
Subject: Re: PHP on HP-UX Itanium 2
References: 1  Groups: php.qa 
Request: Send a blank email to php-qa+get-15710@lists.php.net to get a copy of this message
Sheetz, Michael wrote:
Good afternoon, We currently have PHP installed on our HP Superdome. However, we are getting ready to migrate from RISC to Itanium 2 chips running HP-UX (not Linux). Does the newest version of PHP, 4.3.4RC1, run on HP-UX Itanium 2? Any information would be greatly appreciated.
Compiling is no problem, but there are some tests that fail: ===================================================================== FAILED TEST SUMMARY --------------------------------------------------------------------- Bug #25547 (error_handler and array index with function call) [tests/lang/bug25547.phpt] Bug #25665 (var_dump () hangs on Nan and INF) [ext/standard/tests/math/bug25665.phpt] Bug #23894 (sprintf() decimal specifiers problem) [ext/standard/tests/strings/bug23894.phpt] strtotime() function [ext/standard/tests/time/002.phpt] Bug #13142 strtotime handling of "M d H:i:s Y" format [ext/standard/tests/time/bug13142.phpt] ===================================================================== ===================================================================== TEST RESULT SUMMARY ---------------------------------------------------------------------
Exts skipped    :   78
Exts tested     :    9
--------------------------------------------------------------------- Number of tests : 526 Tests skipped : 247 (47.0%)
Tests warned    :    0 ( 0.0%)
Tests failed    :    5 ( 1.0%)
Tests passed    :  274 (52.1%)
---------------------------------------------------------------------
Time taken      :   67 seconds
===================================================================== ================================================================================ /house/phpqa/php-4.3.4RC1/tests/lang/bug25547.phpt ================================================================================ ---- EXPECTED OUTPUT handler(Undefined index: foo) Array (
    [foo] => 1
) Done ---- ACTUAL OUTPUT handler(Undefined index: foo) Array (
    [ oo] => 1
) Done ---- FAILED ================================================================================
004-     [foo] => 1
004+     [ oo] => 1
================================================================================ ================================================================================ /house/phpqa/php-4.3.4RC1/ext/standard/tests/math/bug25665.phpt ================================================================================ ---- EXPECTED OUTPUT float(NAN) float(-INF) ---- ACTUAL OUTPUT Fatal error: Maximum execution time of 5 seconds exceeded in /house/phpqa/php-4.3.4RC1/ext/standard/tests/math/bug25665.php on line 3 ---- FAILED ================================================================================ 001- float(NAN) 001+ Fatal error: Maximum execution time of 5 seconds exceeded in /house/phpqa/php-4.3.4RC1/ext/standard/tests/math/bug25665.php on line 3 002- float(-INF) ================================================================================ ================================================================================ /house/phpqa/php-4.3.4RC1/ext/standard/tests/strings/bug23894.phpt ================================================================================ ---- EXPECTED OUTPUT string(4) "-012" string(8) "2d303132" string(13) " 4294967284" string(26) "20202034323934393637323834" ---- ACTUAL OUTPUT string(4) "0000" string(8) "30303030"
string(13) "            0"
string(26) "20202020202020202020202030" ---- FAILED ================================================================================ 001- string(4) "-012" 001+ string(4) "0000" 002- string(8) "2d303132" 002+ string(8) "30303030" 003- string(13) " 4294967284"
003+ string(13) "            0"
004- string(26) "20202034323934393637323834" 004+ string(26) "20202020202020202020202030" ================================================================================ ================================================================================ /house/phpqa/php-4.3.4RC1/ext/standard/tests/time/002.phpt ================================================================================ ---- EXPECTED OUTPUT 1999-10-13 00:00:00 1999-10-13 00:00:00 2000-01-19 00:00:00 2000-01-19 00:00:00 2001-12-21 00:00:00 2001-12-21 00:00:00 2001-12-21 12:16:00 2001-12-21 12:16:00 1969-12-31 23:59:59 2001-10-22 21:19:58 2001-10-22 23:19:58 2001-10-22 23:32:58 2001-10-22 19:19:58 2001-10-22 19:06:58 1999-10-13 00:00:00 1999-10-13 00:00:00 2000-01-19 00:00:00 2000-01-19 00:00:00 2001-12-21 00:00:00 2001-12-21 00:00:00 2001-12-21 12:16:00 2001-12-21 12:16:00 1969-12-31 18:59:59 2001-10-22 21:19:58 2001-10-22 19:19:58 2001-10-22 19:32:58 2001-10-22 15:19:58 2001-10-22 15:06:58 ---- ACTUAL OUTPUT 1999-10-13 00:00:00 1999-10-13 00:00:00 2000-01-19 00:00:00 2000-01-19 00:00:00 2001-12-21 00:00:00 2001-12-21 00:00:00 2001-12-21 12:16:00 2001-12-21 12:16:00 1969-12-31 23:59:59 2001-10-22 21:19:58 2001-10-22 23:19:58 2001-10-22 23:32:58 2001-10-22 19:19:58 2001-10-22 19:06:58 1999-10-13 00:00:00 1999-10-13 00:00:00 2000-01-19 00:00:00 2000-01-19 00:00:00 2001-12-21 00:00:00 2001-12-21 00:00:00 2001-12-21 12:16:00 2001-12-21 12:16:00 1969-12-31 23:59:59 2001-10-22 21:19:58 2001-10-22 23:19:58 2001-10-22 23:32:58 2001-10-22 19:19:58 2001-10-22 19:06:58 ---- FAILED ================================================================================ 023- 1969-12-31 18:59:59 023+ 1969-12-31 23:59:59 025- 2001-10-22 19:19:58 025+ 2001-10-22 23:19:58 026- 2001-10-22 19:32:58 026+ 2001-10-22 23:32:58 027- 2001-10-22 15:19:58 027+ 2001-10-22 19:19:58 028- 2001-10-22 15:06:58 028+ 2001-10-22 19:06:58 ================================================================================ ================================================================================ /house/phpqa/php-4.3.4RC1/ext/standard/tests/time/bug13142.phpt ================================================================================ ---- EXPECTED OUTPUT Tue, 4 Sep 2001 16:39:45 -0400 Tue, 4 Sep 2001 16:39:45 -0400 ---- ACTUAL OUTPUT Tue, 4 Sep 2001 16:39:45 +0000 Tue, 4 Sep 2001 16:39:45 +0000 ---- FAILED ================================================================================ 001- Tue, 4 Sep 2001 16:39:45 -0400 001+ Tue, 4 Sep 2001 16:39:45 +0000 002- Tue, 4 Sep 2001 16:39:45 -0400 002+ Tue, 4 Sep 2001 16:39:45 +0000 ================================================================================ ================================================================================ BUILD ENVIRONMENT ================================================================================ OS: HP-UX - HP-UX spe176 B.11.22 U ia64 Automake: Autoconf: Libtool: ltmain.sh (GNU libtool) 1.4.3 (1.922.2.110 2002/10/23 01:39:54) Compiler: Reading specs from /usr/local/lib/gcc-lib/ia64-hp-hpux11.20/3.2/specs Configured with: ../gcc/configure --enable-languages=c,c++ --host=ia64-hp-hpux11.20 --target=ia64-hp-hpux11.20 --with-ld=/usr/ccs/bin/ld --with-gnu-as --enable-libstdcxx-v3 --disable-checking Thread model: single gcc version 3.2 20020329 (experimental) Bison: Libraries: libm.so.1 => /lib/hpux32/libm.so.1 libnsl.so.1 => /lib/hpux32/libnsl.so.1 libc.so.1 => /lib/hpux32/libc.so.1 libxti.so.1 => /usr/lib/hpux32/libxti.so.1 libdl.so.1 => /usr/lib/hpux32/libdl.so.1 /opt/graphics/OpenGL/lib/hpux32/libogltls.so => /opt/graphics/OpenGL/lib/hpux32/libogltls.so ================================================================================ PHPINFO ================================================================================ phpinfo() PHP Version => 4.3.4RC1 System => HP-UX spe176 B.11.22 U ia64 Build Date => Oct 9 2003 16:15:21 Configure Command => './configure' '--enable-cli' Server API => Command Line Interface Virtual Directory Support => disabled Configuration File (php.ini) Path => /usr/local/lib PHP API => 20020918 PHP Extension => 20020429 Zend Extension => 20021010 Debug Build => no Thread Safety => disabled Registered PHP Streams => php, http, ftp This program makes use of the Zend Scripting Language Engine: Zend Engine v1.3.0, Copyright (c) 1998-2003 Zend Technologies _______________________________________________________________________ Configuration PHP Core Directive => Local Value => Master Value allow_call_time_pass_reference => On => On allow_url_fopen => On => On always_populate_raw_post_data => Off => Off arg_separator.input => & => & arg_separator.output => & => & asp_tags => Off => Off auto_append_file => no value => no value auto_prepend_file => no value => no value browscap => no value => no value default_charset => no value => no value default_mimetype => text/html => text/html define_syslog_variables => Off => Off disable_classes => no value => no value disable_functions => no value => no value display_errors => On => On display_startup_errors => Off => Off doc_root => no value => no value docref_ext => no value => no value docref_root => no value => no value enable_dl => On => On error_append_string => no value => no value error_log => no value => no value error_prepend_string => no value => no value error_reporting => no value => no value expose_php => On => On extension_dir => /usr/local/lib/php/extensions/no-debug-non-zts-20020429 => /usr/local/lib/php/extensions/no-debug-non-zts-20020429 file_uploads => On => On gpc_order => GPC => GPC highlight.bg => #FFFFFF => #FFFFFF highlight.comment => #FF8000 => #FF8000 highlight.default => #0000BB => #0000BB highlight.html => #000000 => #000000 highlight.keyword => #007700 => #007700 highlight.string => #DD0000 => #DD0000 html_errors => On => On ignore_repeated_errors => Off => Off ignore_repeated_source => Off => Off ignore_user_abort => Off => Off implicit_flush => Off => Off include_path => .:/usr/local/lib/php => .:/usr/local/lib/php log_errors => Off => Off log_errors_max_len => 1024 => 1024 magic_quotes_gpc => On => On magic_quotes_runtime => Off => Off magic_quotes_sybase => Off => Off max_execution_time => 30 => 30 max_input_time => -1 => -1 open_basedir => no value => no value output_buffering => 0 => 0 output_handler => no value => no value post_max_size => 8M => 8M precision => 14 => 14 register_argc_argv => On => On register_globals => Off => Off report_memleaks => On => On safe_mode => Off => Off safe_mode_exec_dir => /usr/local/php/bin => /usr/local/php/bin safe_mode_gid => Off => Off safe_mode_include_dir => no value => no value sendmail_from => no value => no value sendmail_path => /usr/sbin/sendmail -t -i => /usr/sbin/sendmail -t -i serialize_precision => 100 => 100 short_open_tag => On => On SMTP => localhost => localhost smtp_port => 25 => 25 sql.safe_mode => Off => Off track_errors => Off => Off unserialize_callback_func => no value => no value upload_max_filesize => 2M => 2M upload_tmp_dir => no value => no value user_dir => no value => no value variables_order => no value => no value xmlrpc_error_number => 0 => 0 xmlrpc_errors => Off => Off y2k_compliance => On => On ctype ctype functions => enabled mysql MySQL Support => enabled Active Persistent Links => 0 Active Links => 0 Client API version => 3.23.49 MYSQL_MODULE_TYPE => builtin MYSQL_SOCKET => /tmp/mysql.sock MYSQL_INCLUDE => MYSQL_LIBS => Directive => Local Value => Master Value mysql.allow_persistent => On => On mysql.connect_timeout => 60 => 60 mysql.default_host => no value => no value mysql.default_password => no value => no value mysql.default_port => no value => no value mysql.default_socket => no value => no value mysql.default_user => no value => no value mysql.max_links => Unlimited => Unlimited mysql.max_persistent => Unlimited => Unlimited mysql.trace_mode => Off => Off overload User-Space Object Overloading Support => enabled pcre PCRE (Perl Compatible Regular Expressions) Support => enabled PCRE Library Version => 4.3 21-May-2003 posix Revision => $Revision: 1.51.2.2 $ session Session Support => enabled Registered save handlers => files user Directive => Local Value => Master Value session.auto_start => Off => Off session.bug_compat_42 => On => On session.bug_compat_warn => On => On session.cache_expire => 180 => 180 session.cache_limiter => nocache => nocache session.cookie_domain => no value => no value session.cookie_lifetime => 0 => 0 session.cookie_path => / => / session.cookie_secure => Off => Off session.entropy_file => no value => no value session.entropy_length => 0 => 0 session.gc_divisor => 100 => 100 session.gc_maxlifetime => 1440 => 1440 session.gc_probability => 1 => 1 session.name => PHPSESSID => PHPSESSID session.referer_check => no value => no value session.save_handler => files => files session.save_path => /tmp => /tmp session.serialize_handler => php => php session.use_cookies => On => On session.use_only_cookies => Off => Off session.use_trans_sid => Off => Off standard Regex Library => Bundled library enabled Dynamic Library Support => enabled Path to sendmail => /usr/sbin/sendmail -t -i Directive => Local Value => Master Value assert.active => 1 => 1 assert.bail => 0 => 0 assert.callback => no value => no value assert.quiet_eval => 0 => 0 assert.warning => 1 => 1 auto_detect_line_endings => 0 => 0 default_socket_timeout => 60 => 60 safe_mode_allowed_env_vars => PHP_ => PHP_ safe_mode_protected_env_vars => LD_LIBRARY_PATH => LD_LIBRARY_PATH url_rewriter.tags => a=href,area=href,frame=src,form=,fieldset= => a=href,area=href,frame=src,form=,fieldset= user_agent => no value => no value tokenizer Tokenizer Support => enabled xml XML Support => active XML Namespace Support => active EXPAT Version => 1.95.6 Additional Modules Module Name Environment Variable => Value _ => /house/phpqa/php-4.3.4RC1/sapi/cli/php MANPATH => /opt/mpi/share/man:/usr/share/man/%L:/usr/share/man:/usr/contrib/man/%L:/usr/contrib/man:/usr/local/man/%L:/usr/local/man:/usr/dt/share/man:/opt/samba/man:/opt/resmon/share/man:/opt/mlib/share/man:/opt/OpenSource/man:/opt/graphics/common/man:/opt/ignite/share/man/%L:/opt/ignite/share/man:/opt/fortran90/share/man/%L:/opt/fortran90/share/man:/opt/fortran90/contrib/man:/opt/caliper/man/%L:/opt/caliper/man:/opt/aCC/share/man/%L:/opt/aCC/share/man:/opt/langtools/share/man/%L:/opt/langtools/share/man:/opt/langtools/man/%L:/opt/langtools/man:/opt/ansic/share/man/%L:/opt/ansic/share/man:/opt/imake/man:/opt/tru64/man:/opt/STKT/share/man __ARIES_PA_CORE_SIZE_32BIT_cur => 0 QUERY_STRING => PATH => /house/phpqa/bin:/usr/bin:/opt/ansic/bin:/usr/ccs/bin:/usr/contrib/bin:/usr/contrib/Q4/bin:/opt/mpi/bin:/opt/hparray/bin:/opt/fcms/bin:/opt/netscape:/usr/local/bin:/opt/atok/bin:/usr/bin/X11:/usr/contrib/bin/X11:/opt/resmon/bin:/opt/OpenSource/bin:/opt/upgrade/bin:/opt/graphics/common/bin:/opt/fortran90/bin:/opt/fortran90/contrib/bin:/opt/caliper/bin:/opt/aCC/bin:/opt/langtools/bin:/opt/imake/bin:/opt/tru64/bin:/opt/STKT/bin:/opt/graphics//phigs/bin OLDPWD => /house/phpqa SCRIPT_FILENAME => CONTENT_TYPE => COLUMNS => 80 LOGNAME => phpqa REDIRECT_STATUS => __ARIES_PA_CORE_SIZE_32BIT_max => 0 MAKEFLAGS => b MAIL => /var/mail/phpqa HOSTNAME => spe176 HOST => spe176 REQUEST_METHOD => PATH_TRANSLATED => SHLVL => 1 __ARIES_PA_STACK_SIZE_32BIT_cur => 33554432 CC => gcc CONTENT_LENGTH => TEST_PHP_EXECUTABLE => /house/phpqa/php-4.3.4RC1/sapi/cli/php SHELL => /bin/csh HOSTTYPE => hppa2.0w OSTYPE => hpux11.00 HOME => /house/phpqa TEST_PHP_SRCDIR => /house/phpqa/php-4.3.4RC1 TERM => xterm __ARIES_PA_STACK_SIZE_32BIT_max => 33554432 PWD => /house/phpqa/php-4.3.4RC1 MACHTYPE => hppa2.0w-hp-hpux11.00 TZ => EST5EDT LINES => 44 __ARIES_PA_AOUT_MAXSSIZ_32BIT => 33554432 PHP Variables Variable => Value _SERVER["_"] => /house/phpqa/php-4.3.4RC1/sapi/cli/php _SERVER["MANPATH"] => /opt/mpi/share/man:/usr/share/man/%L:/usr/share/man:/usr/contrib/man/%L:/usr/contrib/man:/usr/local/man/%L:/usr/local/man:/usr/dt/share/man:/opt/samba/man:/opt/resmon/share/man:/opt/mlib/share/man:/opt/OpenSource/man:/opt/graphics/common/man:/opt/ignite/share/man/%L:/opt/ignite/share/man:/opt/fortran90/share/man/%L:/opt/fortran90/share/man:/opt/fortran90/contrib/man:/opt/caliper/man/%L:/opt/caliper/man:/opt/aCC/share/man/%L:/opt/aCC/share/man:/opt/langtools/share/man/%L:/opt/langtools/share/man:/opt/langtools/man/%L:/opt/langtools/man:/opt/ansic/share/man/%L:/opt/ansic/share/man:/opt/imake/man:/opt/tru64/man:/opt/STKT/share/man _SERVER["__ARIES_PA_CORE_SIZE_32BIT_cur"] => 0 _SERVER["QUERY_STRING"] => _SERVER["PATH"] => /house/phpqa/bin:/usr/bin:/opt/ansic/bin:/usr/ccs/bin:/usr/contrib/bin:/usr/contrib/Q4/bin:/opt/mpi/bin:/opt/hparray/bin:/opt/fcms/bin:/opt/netscape:/usr/local/bin:/opt/atok/bin:/usr/bin/X11:/usr/contrib/bin/X11:/opt/resmon/bin:/opt/OpenSource/bin:/opt/upgrade/bin:/opt/graphics/common/bin:/opt/fortran90/bin:/opt/fortran90/contrib/bin:/opt/caliper/bin:/opt/aCC/bin:/opt/langtools/bin:/opt/imake/bin:/opt/tru64/bin:/opt/STKT/bin:/opt/graphics//phigs/bin _SERVER["OLDPWD"] => /house/phpqa _SERVER["SCRIPT_FILENAME"] => _SERVER["CONTENT_TYPE"] => _SERVER["COLUMNS"] => 80 _SERVER["LOGNAME"] => phpqa _SERVER["REDIRECT_STATUS"] => _SERVER["__ARIES_PA_CORE_SIZE_32BIT_max"] => 0 _SERVER["MAKEFLAGS"] => b _SERVER["MAIL"] => /var/mail/phpqa _SERVER["HOSTNAME"] => spe176 _SERVER["HOST"] => spe176 _SERVER["REQUEST_METHOD"] => _SERVER["PATH_TRANSLATED"] => _SERVER["SHLVL"] => 1 _SERVER["__ARIES_PA_STACK_SIZE_32BIT_cur"] => 33554432 _SERVER["CC"] => gcc _SERVER["CONTENT_LENGTH"] => _SERVER["TEST_PHP_EXECUTABLE"] => /house/phpqa/php-4.3.4RC1/sapi/cli/php _SERVER["SHELL"] => /bin/csh _SERVER["HOSTTYPE"] => hppa2.0w _SERVER["OSTYPE"] => hpux11.00 _SERVER["HOME"] => /house/phpqa _SERVER["TEST_PHP_SRCDIR"] => /house/phpqa/php-4.3.4RC1 _SERVER["TERM"] => xterm _SERVER["__ARIES_PA_STACK_SIZE_32BIT_max"] => 33554432 _SERVER["PWD"] => /house/phpqa/php-4.3.4RC1 _SERVER["MACHTYPE"] => hppa2.0w-hp-hpux11.00 _SERVER["TZ"] => EST5EDT _SERVER["LINES"] => 44 _SERVER["__ARIES_PA_AOUT_MAXSSIZ_32BIT"] => 33554432 _SERVER["PHP_SELF"] => _SERVER["SCRIPT_NAME"] => _SERVER["DOCUMENT_ROOT"] => _SERVER["argv"] => Array ( ) _SERVER["argc"] => 0 _ENV["_"] => /house/phpqa/php-4.3.4RC1/sapi/cli/php _ENV["MANPATH"] => /opt/mpi/share/man:/usr/share/man/%L:/usr/share/man:/usr/contrib/man/%L:/usr/contrib/man:/usr/local/man/%L:/usr/local/man:/usr/dt/share/man:/opt/samba/man:/opt/resmon/share/man:/opt/mlib/share/man:/opt/OpenSource/man:/opt/graphics/common/man:/opt/ignite/share/man/%L:/opt/ignite/share/man:/opt/fortran90/share/man/%L:/opt/fortran90/share/man:/opt/fortran90/contrib/man:/opt/caliper/man/%L:/opt/caliper/man:/opt/aCC/share/man/%L:/opt/aCC/share/man:/opt/langtools/share/man/%L:/opt/langtools/share/man:/opt/langtools/man/%L:/opt/langtools/man:/opt/ansic/share/man/%L:/opt/ansic/share/man:/opt/imake/man:/opt/tru64/man:/opt/STKT/share/man _ENV["__ARIES_PA_CORE_SIZE_32BIT_cur"] => 0 _ENV["QUERY_STRING"] => _ENV["PATH"] => /house/phpqa/bin:/usr/bin:/opt/ansic/bin:/usr/ccs/bin:/usr/contrib/bin:/usr/contrib/Q4/bin:/opt/mpi/bin:/opt/hparray/bin:/opt/fcms/bin:/opt/netscape:/usr/local/bin:/opt/atok/bin:/usr/bin/X11:/usr/contrib/bin/X11:/opt/resmon/bin:/opt/OpenSource/bin:/opt/upgrade/bin:/opt/graphics/common/bin:/opt/fortran90/bin:/opt/fortran90/contrib/bin:/opt/caliper/bin:/opt/aCC/bin:/opt/langtools/bin:/opt/imake/bin:/opt/tru64/bin:/opt/STKT/bin:/opt/graphics//phigs/bin _ENV["OLDPWD"] => /house/phpqa _ENV["SCRIPT_FILENAME"] => _ENV["CONTENT_TYPE"] => _ENV["COLUMNS"] => 80 _ENV["LOGNAME"] => phpqa _ENV["REDIRECT_STATUS"] => _ENV["__ARIES_PA_CORE_SIZE_32BIT_max"] => 0 _ENV["MAKEFLAGS"] => b _ENV["MAIL"] => /var/mail/phpqa _ENV["HOSTNAME"] => spe176 _ENV["HOST"] => spe176 _ENV["REQUEST_METHOD"] => _ENV["PATH_TRANSLATED"] => _ENV["SHLVL"] => 1 _ENV["__ARIES_PA_STACK_SIZE_32BIT_cur"] => 33554432 _ENV["CC"] => gcc _ENV["CONTENT_LENGTH"] => _ENV["TEST_PHP_EXECUTABLE"] => /house/phpqa/php-4.3.4RC1/sapi/cli/php _ENV["SHELL"] => /bin/csh _ENV["HOSTTYPE"] => hppa2.0w _ENV["OSTYPE"] => hpux11.00 _ENV["HOME"] => /house/phpqa _ENV["TEST_PHP_SRCDIR"] => /house/phpqa/php-4.3.4RC1 _ENV["TERM"] => xterm _ENV["__ARIES_PA_STACK_SIZE_32BIT_max"] => 33554432 _ENV["PWD"] => /house/phpqa/php-4.3.4RC1 _ENV["MACHTYPE"] => hppa2.0w-hp-hpux11.00 _ENV["TZ"] => EST5EDT _ENV["LINES"] => 44 _ENV["__ARIES_PA_AOUT_MAXSSIZ_32BIT"] => 33554432 PHP License This program is free software; you can redistribute it and/or modify it under the terms of the PHP License as published by the PHP Group and included in the distribution in the file: LICENSE This program is distributed in the hope that it will be useful, but WITHOUT ANY WARRANTY; without even the implied warranty of MERCHANTABILITY or FITNESS FOR A PARTICULAR PURPOSE. If you did not receive a copy of the PHP license, or have any questions about PHP licensing, please contact license@php.net. Regards, Sebastian -- Sebastian Nohn - Wismarer Str. 22 - D-53757 Sankt Augustin - Germany mobile: +49 170 471 8105 email: sebastian@nohn.net web: http://nohn.net did i help you? consider a gift: http://wishlist.nohn.net/

« previous php.qa (#15710) next »