Test results for php4-STABLE-200310100730 on Solaris
| From: | Michael Mauch | Date: | Fri, 10 Oct 2003 22:27:45 +0000 |
| Subject: | Test results for php4-STABLE-200310100730 on Solaris | ||
| Groups: | php.qa | ||
| Request: | Send a blank email to php-qa+get-15711@lists.php.net to get a copy of this message | ||
=====================================================================
FAILED TEST SUMMARY
---------------------------------------------------------------------
Testing $argc and $argv handling (GET) [tests/basic/011.phpt]
Bug #25547 (error_handler and array index with function call) [tests/lang/bug25547.phpt]
Gettext basic test [ext/gettext/tests/gettext_basic.phpt]
OpenSSL private key functions [ext/openssl/tests/001.phpt]
openssl: get public key from generated private key [ext/openssl/tests/bug25614.phpt]
Bug #25665 (var_dump () hangs on Nan and INF) [ext/standard/tests/math/bug25665.phpt]
=====================================================================
=====================================================================
TEST RESULT SUMMARY
---------------------------------------------------------------------
Exts skipped : 68
Exts tested : 19
---------------------------------------------------------------------
Number of tests : 533
Tests skipped : 210 (39.4%)
Tests warned : 0 ( 0.0%)
Tests failed : 6 ( 1.1%)
Tests passed : 317 (59.5%)
---------------------------------------------------------------------
Time taken : 162 seconds
=====================================================================
================================================================================
/export/home/Team/local/src/php4-STABLE-200310100730/tests/basic/011.phpt
================================================================================
---- EXPECTED OUTPUT
0: ab
1: cd
2: ef
3: 123
4: test
---- ACTUAL OUTPUT
PHP Notice: Undefined index: argc in
/export/home/Team/local/src/php4-STABLE-200310100730/tests/basic/011.php on line 4
PHP Notice: Undefined index: argv in
/export/home/Team/local/src/php4-STABLE-200310100730/tests/basic/011.php on line 5
Content-type: text/html
X-Powered-By: PHP/4.3.4RC2-dev
---- FAILED
================================================================================
001- 0: ab
001+ PHP Notice: Undefined index: argc in
/export/home/Team/local/src/php4-STABLE-200310100730/tests/basic/011.php on line 4
002- 1: cd
002+ PHP Notice: Undefined index: argv in
/export/home/Team/local/src/php4-STABLE-200310100730/tests/basic/011.php on line 5
003- 2: ef
003+ Content-type: text/html
004- 3: 123
004+ X-Powered-By: PHP/4.3.4RC2-dev
005- 4: test
================================================================================
================================================================================
/export/home/Team/local/src/php4-STABLE-200310100730/tests/lang/bug25547.phpt
================================================================================
---- EXPECTED OUTPUT
handler(Undefined index: foo)
Array
(
[foo] => 1
)
Done
---- ACTUAL OUTPUT
handler(Undefined index: foo)
Array
(
[( o] => 1
)
Done
---- FAILED
================================================================================
004- [foo] => 1
004+ [( o] => 1
================================================================================
================================================================================
/export/home/Team/local/src/php4-STABLE-200310100730/ext/gettext/tests/gettext_basic.phpt
================================================================================
---- EXPECTED OUTPUT
Perustesti
Perustesti
---- ACTUAL OUTPUT
Basic test
Basic test
---- FAILED
================================================================================
001- Perustesti
001+ Basic test
002- Perustesti
002+ Basic test
================================================================================
================================================================================
/export/home/Team/local/src/php4-STABLE-200310100730/ext/openssl/tests/001.phpt
================================================================================
---- EXPECTED OUTPUT
Creating private key
Export key to file
Load key from file - array syntax
Load key using direct syntax
Load key manually and use string syntax
OK!
---- ACTUAL OUTPUT
Creating private key
Warning: openssl_pkey_new(): unable to load random state; not enough random data! in
/export/home/Team/local/src/php4-STABLE-200310100730/ext/openssl/tests/001.php on line 13
failed to create private key
---- FAILED
================================================================================
002- Export key to file
002+
003- Load key from file - array syntax
003+ Warning: openssl_pkey_new(): unable to load random state; not enough random data! in
/export/home/Team/local/src/php4-STABLE-200310100730/ext/openssl/tests/001.php on line 13
004- Load key using direct syntax
004+ failed to create private key
005- Load key manually and use string syntax
006- OK!
================================================================================
================================================================================
/export/home/Team/local/src/php4-STABLE-200310100730/ext/openssl/tests/bug25614.phpt
================================================================================
---- EXPECTED OUTPUT
Warning: openssl_pkey_get_public(): Don't know how to get public key from this private key (the
documentation lied) %s
---- ACTUAL OUTPUT
Warning: openssl_pkey_new(): unable to load random state; not enough random data! in
/export/home/Team/local/src/php4-STABLE-200310100730/ext/openssl/tests/bug25614.php on line 2
---- FAILED
================================================================================
001- Warning: openssl_pkey_get_public(): Don't know how to get public key from this private key
(the documentation lied) %s
001+ Warning: openssl_pkey_new(): unable to load random state; not enough random data! in
/export/home/Team/local/src/php4-STABLE-200310100730/ext/openssl/tests/bug25614.php on line 2
================================================================================
================================================================================
/export/home/Team/local/src/php4-STABLE-200310100730/ext/standard/tests/math/bug25665.phpt
================================================================================
---- EXPECTED OUTPUT
float(NAN)
float(-INF)
---- ACTUAL OUTPUT
float(0)
float(-INF)
---- FAILED
================================================================================
001- float(NAN)
001+ float(0)
================================================================================
================================================================================
BUILD ENVIRONMENT
================================================================================
OS:
SunOS - SunOS bnsisr13 5.7 Generic_106541-15 sun4us
Automake:
automake (GNU automake) 1.7.3
Written by Tom Tromey <tromey@redhat.com>.
Copyright 2003 Free Software Foundation, Inc.
This is free software; see the source for copying conditions. There is NO
warranty; not even for MERCHANTABILITY or FITNESS FOR A PARTICULAR PURPOSE.
Autoconf:
autoconf (GNU Autoconf) 2.57
Written by David J. MacKenzie and Akim Demaille.
Copyright 2002 Free Software Foundation, Inc.
This is free software; see the source for copying conditions. There is NO
warranty; not even for MERCHANTABILITY or FITNESS FOR A PARTICULAR PURPOSE.
Libtool:
ltmain.sh (GNU libtool) 1.4.3 (1.922.2.110 2002/10/23 01:39:54)
Compiler:
Reading specs from /usr/local/lib/gcc-lib/sparc-sun-solaris2.7/2.95.3/specs
gcc version 2.95.3 20010315 (release)
Bison:
GNU Bison version 1.28
Libraries:
libintl.so.2 => /Team/local/lib/libintl.so.2
libc.so.1 => /usr/lib/libc.so.1
libpng12.so.0 => /Team/local/lib/libpng12.so.0
libz.so => /usr/local/lib/libz.so
libresolv.so.2 => /usr/lib/libresolv.so.2
libm.so.1 => /usr/lib/libm.so.1
libdl.so.1 => /usr/lib/libdl.so.1
libnsl.so.1 => /usr/lib/libnsl.so.1
libsocket.so.1 => /usr/lib/libsocket.so.1
libgen.so.1 => /usr/lib/libgen.so.1
libsched.so.1 => /usr/lib/libsched.so.1
libclntsh.so.8.0 => /appl/oracle/product/8.1.7/lib/libclntsh.so.8.0
libmp.so.2 => /usr/lib/libmp.so.2
libwtc8.so => /appl/oracle/product/8.1.7/lib/libwtc8.so
libaio.so.1 => /usr/lib/libaio.so.1
/usr/platform/FJSV,GPUS/lib/libc_psr.so.1
================================================================================
PHPINFO
================================================================================
phpinfo()
PHP Version => 4.3.4RC2-dev
System => SunOS bnsisr13 5.7 Generic_106541-15 sun4us
Build Date => Oct 10 2003 10:05:07
Configure Command => './configure' '--prefix=/Team/local'
'--enable-exif' '--with-calendar=shared' '--enable-wddx'
'--enable-ftp' '--with-openssl=/usr/local' '--with-oci8'
'--with-mysql' '--enable-memory-limit' '--enable-dba'
'--with-flatfile' '--enable-sockets' '--with-gd'
'--with-zlib-dir=/Team/local' '--with-jpeg-dir=/Team/local'
'--with-png-dir=/Team/local' '--with-gettext'
Server API => Command Line Interface
Virtual Directory Support => disabled
Configuration File (php.ini) Path => /export/home/Team/local/lib/php-cli.ini
PHP API => 20020918
PHP Extension => 20020429
Zend Extension => 20021010
Debug Build => no
Thread Safety => disabled
Registered PHP Streams => php, http, ftp, https, ftps, compress.zlib
This program makes use of the Zend Scripting Language Engine:
Zend Engine v1.3.0, Copyright (c) 1998-2003 Zend Technologies
_______________________________________________________________________
Configuration
PHP Core
Directive => Local Value => Master Value
allow_call_time_pass_reference => On => On
allow_url_fopen => On => On
always_populate_raw_post_data => Off => Off
arg_separator.input => & => &
arg_separator.output => & => &
asp_tags => Off => Off
auto_append_file => no value => no value
auto_prepend_file => no value => no value
browscap => no value => no value
default_charset => no value => no value
default_mimetype => text/html => text/html
define_syslog_variables => Off => Off
disable_classes => no value => no value
disable_functions => no value => no value
display_errors => On => On
display_startup_errors => Off => Off
doc_root => no value => no value
docref_ext => no value => no value
docref_root => no value => no value
enable_dl => On => On
error_append_string => no value => no value
error_log => no value => no value
error_prepend_string => no value => no value
error_reporting => 2039 => 2039
expose_php => On => On
extension_dir => ./ => ./
file_uploads => On => On
gpc_order => GPC => GPC
highlight.bg => #FFFFFF => #FFFFFF
highlight.comment => #FF8000 => #FF8000
highlight.default => #0000BB => #0000BB
highlight.html => #000000 => #000000
highlight.keyword => #007700 => #007700
highlight.string => #DD0000 => #DD0000
html_errors => On => On
ignore_repeated_errors => Off => Off
ignore_repeated_source => Off => Off
ignore_user_abort => Off => Off
implicit_flush => Off => Off
include_path => .:/Team/local/lib/php => .:/Team/local/lib/php
log_errors => Off => Off
log_errors_max_len => 1024 => 1024
magic_quotes_gpc => On => On
magic_quotes_runtime => Off => Off
magic_quotes_sybase => Off => Off
max_execution_time => 30 => 30
max_input_time => 60 => 60
memory_limit => 100M => 100M
open_basedir => no value => no value
output_buffering => no value => no value
output_handler => no value => no value
post_max_size => 8M => 8M
precision => 12 => 12
register_argc_argv => On => On
register_globals => Off => Off
report_memleaks => On => On
safe_mode => Off => Off
safe_mode_exec_dir => no value => no value
safe_mode_gid => Off => Off
safe_mode_include_dir => no value => no value
sendmail_from => me@localhost.com => me@localhost.com
sendmail_path => /usr/lib/sendmail -t -i => /usr/lib/sendmail -t -i
serialize_precision => 100 => 100
short_open_tag => On => On
SMTP => localhost => localhost
smtp_port => 25 => 25
sql.safe_mode => Off => Off
track_errors => Off => Off
unserialize_callback_func => no value => no value
upload_max_filesize => 2M => 2M
upload_tmp_dir => no value => no value
user_dir => no value => no value
variables_order => EGPCS => EGPCS
xmlrpc_error_number => 0 => 0
xmlrpc_errors => Off => Off
y2k_compliance => On => On
ctype
ctype functions => enabled
dba
DBA support => enabled
Supported handlers => cdb cdb_make inifile flatfile
exif
EXIF Support => enabled
EXIF Version => 1.4 $Id: exif.c,v 1.118.2.25 2003/09/22 23:28:07 iliaa Exp $
Supported EXIF Version => 0220
Supported filetypes => JPEG,TIFF
ftp
FTP support => enabled
gd
GD Support => enabled
GD Version => bundled (2.0.15 compatible)
GIF Read Support => enabled
JPG Support => enabled
PNG Support => enabled
WBMP Support => enabled
XBM Support => enabled
gettext
GetText Support => enabled
mysql
MySQL Support => enabled
Active Persistent Links => 0
Active Links => 0
Client API version => 3.23.49
MYSQL_MODULE_TYPE => builtin
MYSQL_SOCKET => /tmp/mysql.sock
MYSQL_INCLUDE =>
MYSQL_LIBS =>
Directive => Local Value => Master Value
mysql.allow_persistent => On => On
mysql.connect_timeout => -1 => -1
mysql.default_host => no value => no value
mysql.default_password => no value => no value
mysql.default_port => no value => no value
mysql.default_socket => no value => no value
mysql.default_user => no value => no value
mysql.max_links => Unlimited => Unlimited
mysql.max_persistent => Unlimited => Unlimited
mysql.trace_mode => Off => Off
oci8
OCI8 Support => enabled
Revision => $Revision: 1.183.2.5 $
Oracle Version => 8.1
Compile-time ORACLE_HOME => /appl/oracle/product/8.1.7
Libraries Used =>
openssl
OpenSSL support => enabled
OpenSSL Version => OpenSSL 0.9.6d 9 May 2002
overload
User-Space Object Overloading Support => enabled
pcre
PCRE (Perl Compatible Regular Expressions) Support => enabled
PCRE Library Version => 4.3 21-May-2003
posix
Revision => $Revision: 1.51.2.2 $
session
Session Support => enabled
Registered save handlers => files user
Directive => Local Value => Master Value
session.auto_start => Off => Off
session.bug_compat_42 => On => On
session.bug_compat_warn => On => On
session.cache_expire => 180 => 180
session.cache_limiter => nocache => nocache
session.cookie_domain => no value => no value
session.cookie_lifetime => 0 => 0
session.cookie_path => / => /
session.cookie_secure => Off => Off
session.entropy_file => no value => no value
session.entropy_length => 0 => 0
session.gc_divisor => 100 => 100
session.gc_maxlifetime => 1440 => 1440
session.gc_probability => 1 => 1
session.name => PHPSESSID => PHPSESSID
session.referer_check => no value => no value
session.save_handler => files => files
session.save_path => /tmp => /tmp
session.serialize_handler => php => php
session.use_cookies => On => On
session.use_only_cookies => Off => Off
session.use_trans_sid => Off => Off
sockets
Sockets Support => enabled
standard
Regex Library => Bundled library enabled
Dynamic Library Support => enabled
Path to sendmail => /usr/lib/sendmail -t -i
Directive => Local Value => Master Value
assert.active => 1 => 1
assert.bail => 0 => 0
assert.callback => no value => no value
assert.quiet_eval => 0 => 0
assert.warning => 1 => 1
auto_detect_line_endings => 0 => 0
default_socket_timeout => 60 => 60
safe_mode_allowed_env_vars => PHP_ => PHP_
safe_mode_protected_env_vars => LD_LIBRARY_PATH => LD_LIBRARY_PATH
url_rewriter.tags => a=href,area=href,frame=src,input=src,form=,fieldset= =>
a=href,area=href,frame=src,input=src,form=,fieldset=
user_agent => no value => no value
tokenizer
Tokenizer Support => enabled
wddx
WDDX Support => enabled
WDDX Session Serializer => enabled
xml
XML Support => active
XML Namespace Support => active
EXPAT Version => 1.95.6
zlib
ZLib Support => enabled
Compiled Version => 1.1.3
Linked Version => 1.1.2
Directive => Local Value => Master Value
zlib.output_compression => Off => Off
zlib.output_compression_level => -1 => -1
zlib.output_handler => no value => no value
Additional Modules
Module Name
Environment
Variable => Value
CC => gcc
CONTENT_LENGTH =>
CONTENT_TYPE =>
LD_LIBRARY_PATH =>
/Team/local/lib:/usr/local/lib:/appl/oracle/product/8.1.7/lib:/usr/openwin/lib:/usr/X/lib:/usr/dt/lib:/usr/lib:/usr/ucblib
MAKEFLAGS =>
ORACLE_HOME => /appl/oracle/product/8.1.7
PATH =>
/export/home/mauchm/bin:/Team/scripts:/Team/bin:/Team/local/bin:/usr/xpg4/bin:/usr/ccs/bin:/usr/ucb:/appl/oracle/product/8.1.7/bin:/usr/local/bin:/usr/bin:/bin:/usr/X/bin:/usr/openwin/bin:/usr/dt/bin::/Team/sss/scripts:/Team/sss/bin:/usr/local/sbin:/usr/sbin:/sbin:.
PATH_TRANSLATED =>
QUERY_STRING =>
REDIRECT_STATUS =>
REQUEST_METHOD =>
SCRIPT_FILENAME =>
SGS_SUPPORT => libmakestate.so.1
TEST_PHP_EXECUTABLE => /export/home/Team/local/src/php4-STABLE-200310100730/sapi/cli/php
TEST_PHP_SRCDIR => /export/home/Team/local/src/php4-STABLE-200310100730
VIRTUAL_ROOT => /
PHP Variables
Variable => Value
_SERVER["CC"] => gcc
_SERVER["CONTENT_LENGTH"] =>
_SERVER["CONTENT_TYPE"] =>
_SERVER["LD_LIBRARY_PATH"] =>
/Team/local/lib:/usr/local/lib:/appl/oracle/product/8.1.7/lib:/usr/openwin/lib:/usr/X/lib:/usr/dt/lib:/usr/lib:/usr/ucblib
_SERVER["MAKEFLAGS"] =>
_SERVER["ORACLE_HOME"] => /appl/oracle/product/8.1.7
_SERVER["PATH"] =>
/export/home/mauchm/bin:/Team/scripts:/Team/bin:/Team/local/bin:/usr/xpg4/bin:/usr/ccs/bin:/usr/ucb:/appl/oracle/product/8.1.7/bin:/usr/local/bin:/usr/bin:/bin:/usr/X/bin:/usr/openwin/bin:/usr/dt/bin::/Team/sss/scripts:/Team/sss/bin:/usr/local/sbin:/usr/sbin:/sbin:.
_SERVER["PATH_TRANSLATED"] =>
_SERVER["QUERY_STRING"] =>
_SERVER["REDIRECT_STATUS"] =>
_SERVER["REQUEST_METHOD"] =>
_SERVER["SCRIPT_FILENAME"] =>
_SERVER["SGS_SUPPORT"] => libmakestate.so.1
_SERVER["TEST_PHP_EXECUTABLE"] =>
/export/home/Team/local/src/php4-STABLE-200310100730/sapi/cli/php
_SERVER["TEST_PHP_SRCDIR"] => /export/home/Team/local/src/php4-STABLE-200310100730
_SERVER["VIRTUAL_ROOT"] => /
_SERVER["PHP_SELF"] =>
_SERVER["SCRIPT_NAME"] =>
_SERVER["DOCUMENT_ROOT"] =>
_SERVER["argv"] => Array
(
)
_SERVER["argc"] => 0
_ENV["CC"] => gcc
_ENV["CONTENT_LENGTH"] =>
_ENV["CONTENT_TYPE"] =>
_ENV["LD_LIBRARY_PATH"] =>
/Team/local/lib:/usr/local/lib:/appl/oracle/product/8.1.7/lib:/usr/openwin/lib:/usr/X/lib:/usr/dt/lib:/usr/lib:/usr/ucblib
_ENV["MAKEFLAGS"] =>
_ENV["ORACLE_HOME"] => /appl/oracle/product/8.1.7
_ENV["PATH"] =>
/export/home/mauchm/bin:/Team/scripts:/Team/bin:/Team/local/bin:/usr/xpg4/bin:/usr/ccs/bin:/usr/ucb:/appl/oracle/product/8.1.7/bin:/usr/local/bin:/usr/bin:/bin:/usr/X/bin:/usr/openwin/bin:/usr/dt/bin::/Team/sss/scripts:/Team/sss/bin:/usr/local/sbin:/usr/sbin:/sbin:.
_ENV["PATH_TRANSLATED"] =>
_ENV["QUERY_STRING"] =>
_ENV["REDIRECT_STATUS"] =>
_ENV["REQUEST_METHOD"] =>
_ENV["SCRIPT_FILENAME"] =>
_ENV["SGS_SUPPORT"] => libmakestate.so.1
_ENV["TEST_PHP_EXECUTABLE"] =>
/export/home/Team/local/src/php4-STABLE-200310100730/sapi/cli/php
_ENV["TEST_PHP_SRCDIR"] => /export/home/Team/local/src/php4-STABLE-200310100730
_ENV["VIRTUAL_ROOT"] => /
PHP License
This program is free software; you can redistribute it and/or modify
it under the terms of the PHP License as published by the PHP Group
and included in the distribution in the file: LICENSE
This program is distributed in the hope that it will be useful,
but WITHOUT ANY WARRANTY; without even the implied warranty of
MERCHANTABILITY or FITNESS FOR A PARTICULAR PURPOSE.
If you did not receive a copy of the PHP license, or have any
questions about PHP licensing, please contact license@php.net.