Test results for php4-STABLE-200310100730 on Tru64

From: Date: Fri, 10 Oct 2003 22:29:41 +0000
Subject: Test results for php4-STABLE-200310100730 on Tru64
Groups: php.qa 
Request: Send a blank email to php-qa+get-15712@lists.php.net to get a copy of this message
===================================================================== FAILED TEST SUMMARY --------------------------------------------------------------------- Bug #24054 (Assignment operator *= broken) [tests/lang/bug24054.phpt] Bug #25547 (error_handler and array index with function call) [tests/lang/bug25547.phpt] Gettext basic test [ext/gettext/tests/gettext_basic.phpt] OpenSSL private key functions [ext/openssl/tests/001.phpt] openssl: get public key from generated private key [ext/openssl/tests/bug25614.phpt] Simple math tests [ext/standard/tests/math/abs.phpt] Bug #25665 (var_dump () hangs on Nan and INF) [ext/standard/tests/math/bug25665.phpt] log() tests [ext/standard/tests/math/log.phpt] Various pow() tests [ext/standard/tests/math/pow.phpt] Simple math tests [ext/standard/tests/math/round.phpt] microtime() function [ext/standard/tests/time/001.phpt] (warn: system dependent) strtotime() function [ext/standard/tests/time/002.phpt] Bug #13142 strtotime handling of "M d H:i:s Y" format [ext/standard/tests/time/bug13142.phpt] mktime() [ext/standard/tests/time/mktime.phpt] ===================================================================== ===================================================================== TEST RESULT SUMMARY --------------------------------------------------------------------- Exts skipped : 68 Exts tested : 19 --------------------------------------------------------------------- Number of tests : 533 Tests skipped : 210 (39.4%) Tests warned : 1 ( 0.2%) Tests failed : 13 ( 2.4%) Tests passed : 309 (58.0%) --------------------------------------------------------------------- Time taken : 215 seconds ===================================================================== ================================================================================ /Team/local/src/php4-STABLE-200310100730/tests/lang/bug24054.phpt ================================================================================ ---- EXPECTED OUTPUT float(1.001E+10) float(1.001E+10) ---- ACTUAL OUTPUT int(10010000000) int(10010000000) ---- FAILED ================================================================================ 001- float(1.001E+10) 001+ int(10010000000) 002- float(1.001E+10) 002+ int(10010000000) ================================================================================ ================================================================================ /Team/local/src/php4-STABLE-200310100730/tests/lang/bug25547.phpt ================================================================================ ---- EXPECTED OUTPUT handler(Undefined index: foo) Array ( [foo] => 1 ) Done ---- ACTUAL OUTPUT handler(Undefined index: foo) Array ( [(o] => 1 ) Done ---- FAILED ================================================================================ 004- [foo] => 1 004+ [(o] => 1 ================================================================================ ================================================================================ /Team/local/src/php4-STABLE-200310100730/ext/gettext/tests/gettext_basic.phpt ================================================================================ ---- EXPECTED OUTPUT Perustesti Perustesti ---- ACTUAL OUTPUT Basic test Basic test ---- FAILED ================================================================================ 001- Perustesti 001+ Basic test 002- Perustesti 002+ Basic test ================================================================================ ================================================================================ /Team/local/src/php4-STABLE-200310100730/ext/openssl/tests/001.phpt ================================================================================ ---- EXPECTED OUTPUT Creating private key Export key to file Load key from file - array syntax Load key using direct syntax Load key manually and use string syntax OK! ---- ACTUAL OUTPUT Creating private key Warning: openssl_pkey_new(): unable to load random state; not enough random data! in /Team/local/src/php4-STABLE-200310100730/ext/openssl/tests/001.php on line 13 failed to create private key ---- FAILED ================================================================================ 002- Export key to file 002+ 003- Load key from file - array syntax 003+ Warning: openssl_pkey_new(): unable to load random state; not enough random data! in /Team/local/src/php4-STABLE-200310100730/ext/openssl/tests/001.php on line 13 004- Load key using direct syntax 004+ failed to create private key 005- Load key manually and use string syntax 006- OK! ================================================================================ ================================================================================ /Team/local/src/php4-STABLE-200310100730/ext/openssl/tests/bug25614.phpt ================================================================================ ---- EXPECTED OUTPUT Warning: openssl_pkey_get_public(): Don't know how to get public key from this private key (the documentation lied) %s ---- ACTUAL OUTPUT Warning: openssl_pkey_new(): unable to load random state; not enough random data! in /Team/local/src/php4-STABLE-200310100730/ext/openssl/tests/bug25614.php on line 2 ---- FAILED ================================================================================ 001- Warning: openssl_pkey_get_public(): Don't know how to get public key from this private key (the documentation lied) %s 001+ Warning: openssl_pkey_new(): unable to load random state; not enough random data! in /Team/local/src/php4-STABLE-200310100730/ext/openssl/tests/bug25614.php on line 2 ================================================================================ ================================================================================ /Team/local/src/php4-STABLE-200310100730/ext/standard/tests/math/abs.phpt ================================================================================ ---- EXPECTED OUTPUT 1,1,0,0 OK ---- ACTUAL OUTPUT 1,1,1,1 Assert failed: -LONG_MIN+1 === abs(LONG_MIN-1) Left: int(-9223372036854775807) Right: int(9223372036854775807) Assert failed: -LONG_MIN === abs(LONG_MIN) Left: int(-9223372036854775808) Right: float(9.22337203685E+18) ---- FAILED ================================================================================ 001- 1,1,0,0 001+ 1,1,1,1 002- OK 002+ 003+ Assert failed: 004+ -LONG_MIN+1 === abs(LONG_MIN-1) 005+ Left: int(-9223372036854775807) 006+ Right: int(9223372036854775807) 007+ 008+ Assert failed: 009+ -LONG_MIN === abs(LONG_MIN) 010+ Left: int(-9223372036854775808) 011+ Right: float(9.22337203685E+18) ================================================================================ ================================================================================ /Team/local/src/php4-STABLE-200310100730/ext/standard/tests/math/bug25665.phpt ================================================================================ ---- EXPECTED OUTPUT float(NAN) float(-INF) ---- ACTUAL OUTPUT float(0) float(-1.79769313486E+308) ---- FAILED ================================================================================ 001- float(NAN) 001+ float(0) 002- float(-INF) 002+ float(-1.79769313486E+308) ================================================================================ ================================================================================ /Team/local/src/php4-STABLE-200310100730/ext/standard/tests/math/log.phpt ================================================================================ ---- EXPECTED OUTPUT On failure, please mail result to php-dev@lists.php.net 200 50 50 50 50 50 50 50 50 50 ---- ACTUAL OUTPUT On failure, please mail result to php-dev@lists.php.net 200 ---- FAILED ================================================================================ 003- 50 004- 50 005- 50 006- 50 007- 50 008- 50 009- 50 010- 50 011- 50 ================================================================================ ================================================================================ /Team/local/src/php4-STABLE-200310100730/ext/standard/tests/math/pow.phpt ================================================================================ ---- EXPECTED OUTPUT 1,1,0,0 On failure, please mail result to php-dev@lists.php.net OK ---- ACTUAL OUTPUT 1,1,1,1 On failure, please mail result to php-dev@lists.php.net Assert failed: TRUE === is_infinite(pow(0,-2)) Left: bool(true) Right: bool(false) Assert failed: TRUE === is_infinite(pow(0,-1)) Left: bool(true) Right: bool(false) Assert failed: TRUE === is_infinite(pow(0,-2.0)) Left: bool(true) Right: bool(false) Assert failed: TRUE === is_infinite(pow(0,-1.0)) Left: bool(true) Right: bool(false) Assert failed: TRUE === is_infinite(pow(0.0,-2.0)) Left: bool(true) Right: bool(false) Assert failed: TRUE === is_infinite(pow(0.0,-1.0)) Left: bool(true) Right: bool(false) Assert failed: TRUE === is_infinite(pow( 0.0,-2)) Left: bool(true) Right: bool(false) Assert failed: TRUE === is_infinite(pow( 0.0,-1)) Left: bool(true) Right: bool(false) Assert failed: LONG_MAX-1 === pow(LONG_MAX-1,1) Left: int(9223372036854775806) Right: int(-9223372036854775808) Assert failed: LONG_MIN+1 === pow(LONG_MIN+1,1) Left: int(-9223372036854775807) Right: int(-9223372036854775808) Assert failed: LONG_MAX === pow(LONG_MAX,1) Left: int(9223372036854775807) Right: int(-9223372036854775808) ---- FAILED ================================================================================ 001- 1,1,0,0 001+ 1,1,1,1 003- OK 003+ 004+ Assert failed: 005+ TRUE === is_infinite(pow(0,-2)) 006+ Left: bool(true) 007+ Right: bool(false) 008+ 009+ Assert failed: 010+ TRUE === is_infinite(pow(0,-1)) 011+ Left: bool(true) 012+ Right: bool(false) 013+ 014+ Assert failed: 015+ TRUE === is_infinite(pow(0,-2.0)) 016+ Left: bool(true) 017+ Right: bool(false) 018+ 019+ Assert failed: 020+ TRUE === is_infinite(pow(0,-1.0)) 021+ Left: bool(true) 022+ Right: bool(false) 023+ 024+ Assert failed: 025+ TRUE === is_infinite(pow(0.0,-2.0)) 026+ Left: bool(true) 027+ Right: bool(false) 028+ 029+ Assert failed: 030+ TRUE === is_infinite(pow(0.0,-1.0)) 031+ Left: bool(true) 032+ Right: bool(false) 033+ 034+ Assert failed: 035+ TRUE === is_infinite(pow( 0.0,-2)) 036+ Left: bool(true) 037+ Right: bool(false) 038+ 039+ Assert failed: 040+ TRUE === is_infinite(pow( 0.0,-1)) 041+ Left: bool(true) 042+ Right: bool(false) 043+ 044+ Assert failed: 045+ LONG_MAX-1 === pow(LONG_MAX-1,1) 046+ Left: int(9223372036854775806) 047+ Right: int(-9223372036854775808) 048+ 049+ Assert failed: 050+ LONG_MIN+1 === pow(LONG_MIN+1,1) 051+ Left: int(-9223372036854775807) 052+ Right: int(-9223372036854775808) 053+ 054+ Assert failed: 055+ LONG_MAX === pow(LONG_MAX,1) 056+ Left: int(9223372036854775807) 057+ Right: int(-9223372036854775808) ================================================================================ ================================================================================ /Team/local/src/php4-STABLE-200310100730/ext/standard/tests/math/round.phpt ================================================================================ ---- EXPECTED OUTPUT 1,1,0,0 OK ---- ACTUAL OUTPUT 1,1,1,1 Assert failed: LONG_MIN-1 ~== round(LONG_MIN - 0.6) Left: int(9223372036854775807) Right: float(-9.22337203685E+18) Assert failed: LONG_MIN-1 ~== floor(LONG_MIN - 0.5) Left: int(9223372036854775807) Right: float(-9.22337203685E+18) Assert failed: LONG_MAX+1 ~== ceil(LONG_MAX + 0.5) Left: int(-9223372036854775808) Right: float(9.22337203685E+18) Assert failed: LONG_MAX+1 ~== round(LONG_MAX + 0.6) Left: int(-9223372036854775808) Right: float(9.22337203685E+18) ---- FAILED ================================================================================ 001- 1,1,0,0 001+ 1,1,1,1 002- OK 002+ 003+ Assert failed: 004+ LONG_MIN-1 ~== round(LONG_MIN - 0.6) 005+ Left: int(9223372036854775807) 006+ Right: float(-9.22337203685E+18) 007+ 008+ Assert failed: 009+ LONG_MIN-1 ~== floor(LONG_MIN - 0.5) 010+ Left: int(9223372036854775807) 011+ Right: float(-9.22337203685E+18) 012+ 013+ Assert failed: 014+ LONG_MAX+1 ~== ceil(LONG_MAX + 0.5) 015+ Left: int(-9223372036854775808) 016+ Right: float(9.22337203685E+18) 017+ 018+ Assert failed: 019+ LONG_MAX+1 ~== round(LONG_MAX + 0.6) 020+ Left: int(-9223372036854775808) 021+ Right: float(9.22337203685E+18) ================================================================================ ================================================================================ /Team/local/src/php4-STABLE-200310100730/ext/standard/tests/time/001.phpt (warn: system dependent) ================================================================================ ---- EXPECTED OUTPUT Passed: 100000 Failed: 0 ---- ACTUAL OUTPUT Passed: 4034 Failed: 95966 000002: 1065775395 0.76459500 < 1065775395 0.76459500 000003: 1065775395 0.76459500 < 1065775395 0.76459500 000004: 1065775395 0.76459500 < 1065775395 0.76459500 000005: 1065775395 0.76459500 < 1065775395 0.76459500 000006: 1065775395 0.76459500 < 1065775395 0.76459500 000007: 1065775395 0.76459500 < 1065775395 0.76459500 000008: 1065775395 0.76459500 < 1065775395 0.76459500 000009: 1065775395 0.76459500 < 1065775395 0.76459500 000010: 1065775395 0.76459500 < 1065775395 0.76459500 000012: 1065775395 0.76557100 < 1065775395 0.76557100 000013: 1065775395 0.76557100 < 1065775395 0.76557100 ---- FAILED ================================================================================ 001- Passed: 100000 001+ Passed: 4034 002- Failed: 0 002+ Failed: 95966 003+ 000002: 1065775395 0.76459500 < 1065775395 0.76459500 004+ 000003: 1065775395 0.76459500 < 1065775395 0.76459500 005+ 000004: 1065775395 0.76459500 < 1065775395 0.76459500 006+ 000005: 1065775395 0.76459500 < 1065775395 0.76459500 007+ 000006: 1065775395 0.76459500 < 1065775395 0.76459500 008+ 000007: 1065775395 0.76459500 < 1065775395 0.76459500 009+ 000008: 1065775395 0.76459500 < 1065775395 0.76459500 010+ 000009: 1065775395 0.76459500 < 1065775395 0.76459500 011+ 000010: 1065775395 0.76459500 < 1065775395 0.76459500 012+ 000012: 1065775395 0.76557100 < 1065775395 0.76557100 013+ 000013: 1065775395 0.76557100 < 1065775395 0.76557100 ================================================================================ ================================================================================ /Team/local/src/php4-STABLE-200310100730/ext/standard/tests/time/002.phpt ================================================================================ ---- EXPECTED OUTPUT 1999-10-13 00:00:00 1999-10-13 00:00:00 2000-01-19 00:00:00 2000-01-19 00:00:00 2001-12-21 00:00:00 2001-12-21 00:00:00 2001-12-21 12:16:00 2001-12-21 12:16:00 1969-12-31 23:59:59 2001-10-22 21:19:58 2001-10-22 23:19:58 2001-10-22 23:32:58 2001-10-22 19:19:58 2001-10-22 19:06:58 1999-10-13 00:00:00 1999-10-13 00:00:00 2000-01-19 00:00:00 2000-01-19 00:00:00 2001-12-21 00:00:00 2001-12-21 00:00:00 2001-12-21 12:16:00 2001-12-21 12:16:00 1969-12-31 18:59:59 2001-10-22 21:19:58 2001-10-22 19:19:58 2001-10-22 19:32:58 2001-10-22 15:19:58 2001-10-22 15:06:58 ---- ACTUAL OUTPUT 1999-10-13 00:00:00 1999-10-13 00:00:00 2000-01-19 00:00:00 2000-01-19 00:00:00 2001-12-21 00:00:00 2001-12-21 00:00:00 2001-12-21 12:16:00 2001-12-21 12:16:00 1970-01-01 00:59:59 2001-10-22 21:19:58 2001-10-23 01:19:58 2001-10-23 01:32:58 2001-10-22 21:19:58 2001-10-22 21:06:58 1999-10-13 00:00:00 1999-10-13 00:00:00 2000-01-19 00:00:00 2000-01-19 00:00:00 2001-12-21 00:00:00 2001-12-21 00:00:00 2001-12-21 12:16:00 2001-12-21 12:16:00 1970-01-01 00:59:59 2001-10-22 21:19:58 2001-10-23 01:19:58 2001-10-23 01:32:58 2001-10-22 21:19:58 2001-10-22 21:06:58 ---- FAILED ================================================================================ 009- 1969-12-31 23:59:59 009+ 1970-01-01 00:59:59 011- 2001-10-22 23:19:58 011+ 2001-10-23 01:19:58 012- 2001-10-22 23:32:58 012+ 2001-10-23 01:32:58 013- 2001-10-22 19:19:58 013+ 2001-10-22 21:19:58 014- 2001-10-22 19:06:58 014+ 2001-10-22 21:06:58 023- 1969-12-31 18:59:59 023+ 1970-01-01 00:59:59 025- 2001-10-22 19:19:58 025+ 2001-10-23 01:19:58 026- 2001-10-22 19:32:58 026+ 2001-10-23 01:32:58 027- 2001-10-22 15:19:58 027+ 2001-10-22 21:19:58 028- 2001-10-22 15:06:58 028+ 2001-10-22 21:06:58 ================================================================================ ================================================================================ /Team/local/src/php4-STABLE-200310100730/ext/standard/tests/time/bug13142.phpt ================================================================================ ---- EXPECTED OUTPUT Tue, 4 Sep 2001 16:39:45 -0400 Tue, 4 Sep 2001 16:39:45 -0400 ---- ACTUAL OUTPUT Tue, 4 Sep 2001 16:39:45 +0200 Tue, 4 Sep 2001 16:39:45 +0200 ---- FAILED ================================================================================ 001- Tue, 4 Sep 2001 16:39:45 -0400 001+ Tue, 4 Sep 2001 16:39:45 +0200 002- Tue, 4 Sep 2001 16:39:45 -0400 002+ Tue, 4 Sep 2001 16:39:45 +0200 ================================================================================ ================================================================================ /Team/local/src/php4-STABLE-200310100730/ext/standard/tests/time/mktime.phpt ================================================================================ ---- EXPECTED OUTPUT int(1009843200) int(1009843200) int(1009843200) int(1009843200) int(1025481600) int(1025481600) int(1025481600) int(1025481600) int(1009839600) int(1009839600) int(1009839600) int(1009836000) int(1025474400) int(1025474400) int(1025478000) int(1025474400) ---- ACTUAL OUTPUT int(1009839600) int(1009839600) int(1009839600) int(1009836000) int(1025474400) int(1025474400) int(1025478000) int(1025474400) int(1009839600) int(1009839600) int(1009839600) int(1009836000) int(1025474400) int(1025474400) int(1025478000) int(1025474400) ---- FAILED ================================================================================ 001- int(1009843200) 001+ int(1009839600) 002- int(1009843200) 002+ int(1009839600) 003- int(1009843200) 003+ int(1009839600) 004- int(1009843200) 004+ int(1009836000) 005- int(1025481600) 005+ int(1025474400) 006- int(1025481600) 006+ int(1025474400) 007- int(1025481600) 007+ int(1025478000) 008- int(1025481600) 008+ int(1025474400) ================================================================================ ================================================================================ BUILD ENVIRONMENT ================================================================================ OS: OSF1 - OSF1 bncqsr13.bn.dcn.detemobil.de V4.0 1530 alpha Automake: Autoconf: Libtool: ltmain.sh (GNU libtool) 1.4.3 (1.922.2.110 2002/10/23 01:39:54) Compiler: N/A Bison: bison (GNU Bison) 1.30 Copyright 1984, 1986, 1989, 1992, 2000, 2001 Free Software Foundation, Inc. This is free software; see the source for copying conditions. There is NO warranty; not even for MERCHANTABILITY or FITNESS FOR A PARTICULAR PURPOSE. Libraries: Main => /Team/local/src/php4-STABLE-200310100730/sapi/cli/php libintl.so => /Team/local/lib/libintl.so libiconv.so => /usr/shlib/libiconv.so libc.so => /usr/shlib/libc.so libpng.so.3.1.2.5 => /Team/local/lib/libpng.so.3.1.2.5 libjpeg.so => /Team/local/lib/libjpeg.so libm.so => /usr/shlib/libm.so libexc.so => /usr/shlib/libexc.so librt.so => /usr/shlib/librt.so libaio_raw.so => /usr/shlib/libaio_raw.so libclntsh.so.8.0 => /Team/local/lib/libclntsh.so.8.0 libocijdbc8.so => /appl/oracle/product/8.1.6/lib/libocijdbc8.so libjava.so => /usr/shlib/libjava.so libwtc8.so => /Team/local/lib/libwtc8.so libpthread.so => /usr/shlib/libpthread.so libmach.so => /usr/shlib/libmach.so ================================================================================ PHPINFO ================================================================================ phpinfo() PHP Version => 4.3.4RC2-dev System => OSF1 bncqsr13.bn.dcn.detemobil.de V4.0 1530 alpha Build Date => Oct 10 2003 10:27:27 Configure Command => './configure' '--prefix=/Team/local' '--enable-exif' '--with-calendar=shared' '--enable-wddx' '--enable-ftp' '--with-openssl=/usr/local' '--with-oci8' '--enable-sigchild' '--with-mysql' '--enable-memory-limit' '--enable-dba' '--with-flatfile' '--enable-sockets' '--with-gd' '--with-zlib-dir=/Team/local' '--with-jpeg-dir=/Team/local' '--with-png-dir=/Team/local' '--with-gettext=/Team/local' '' Server API => Command Line Interface Virtual Directory Support => disabled Configuration File (php.ini) Path => /Team/local/lib/php.ini PHP API => 20020918 PHP Extension => 20020429 Zend Extension => 20021010 Debug Build => no Thread Safety => disabled Registered PHP Streams => php, http, ftp, https, ftps, compress.zlib This program makes use of the Zend Scripting Language Engine: Zend Engine v1.3.0, Copyright (c) 1998-2003 Zend Technologies _______________________________________________________________________ Configuration PHP Core Directive => Local Value => Master Value allow_call_time_pass_reference => On => On allow_url_fopen => On => On always_populate_raw_post_data => Off => Off arg_separator.input => & => & arg_separator.output => & => & asp_tags => Off => Off auto_append_file => no value => no value auto_prepend_file => no value => no value browscap => no value => no value default_charset => no value => no value default_mimetype => text/html => text/html define_syslog_variables => Off => Off disable_classes => no value => no value disable_functions => no value => no value display_errors => On => On display_startup_errors => Off => Off doc_root => no value => no value docref_ext => no value => no value docref_root => no value => no value enable_dl => On => On error_append_string => no value => no value error_log => no value => no value error_prepend_string => no value => no value error_reporting => 2039 => 2039 expose_php => On => On extension_dir => ./ => ./ file_uploads => On => On gpc_order => GPC => GPC highlight.bg => #FFFFFF => #FFFFFF highlight.comment => #FF9900 => #FF9900 highlight.default => #0000CC => #0000CC highlight.html => #000000 => #000000 highlight.keyword => #006600 => #006600 highlight.string => #CC0000 => #CC0000 html_errors => On => On ignore_repeated_errors => Off => Off ignore_repeated_source => Off => Off ignore_user_abort => Off => Off implicit_flush => Off => Off include_path => .:/Team/local/lib/php => .:/Team/local/lib/php log_errors => Off => Off log_errors_max_len => 1024 => 1024 magic_quotes_gpc => On => On magic_quotes_runtime => Off => Off magic_quotes_sybase => Off => Off max_execution_time => 30 => 30 max_input_time => -1 => -1 memory_limit => 8M => 8M open_basedir => no value => no value output_buffering => no value => no value output_handler => no value => no value post_max_size => 8M => 8M precision => 12 => 12 register_argc_argv => On => On register_globals => On => On report_memleaks => On => On safe_mode => Off => Off safe_mode_exec_dir => no value => no value safe_mode_gid => Off => Off safe_mode_include_dir => no value => no value sendmail_from => me@localhost.com => me@localhost.com sendmail_path => /usr/sbin/sendmail -t -i => /usr/sbin/sendmail -t -i serialize_precision => 100 => 100 short_open_tag => On => On SMTP => localhost => localhost smtp_port => 25 => 25 sql.safe_mode => Off => Off track_errors => Off => Off unserialize_callback_func => no value => no value upload_max_filesize => 20M => 20M upload_tmp_dir => no value => no value user_dir => no value => no value variables_order => EGPCS => EGPCS xmlrpc_error_number => 0 => 0 xmlrpc_errors => Off => Off y2k_compliance => Off => Off ctype ctype functions => enabled dba DBA support => enabled Supported handlers => cdb cdb_make inifile flatfile exif EXIF Support => enabled EXIF Version => 1.4 $Id: exif.c,v 1.118.2.25 2003/09/22 23:28:07 iliaa Exp $ Supported EXIF Version => 0220 Supported filetypes => JPEG,TIFF ftp FTP support => enabled gd GD Support => enabled GD Version => bundled (2.0.15 compatible) GIF Read Support => enabled JPG Support => enabled PNG Support => enabled WBMP Support => enabled XBM Support => enabled gettext GetText Support => enabled mysql MySQL Support => enabled Active Persistent Links => 0 Active Links => 0 Client API version => 3.23.49 MYSQL_MODULE_TYPE => builtin MYSQL_SOCKET => /tmp/mysql.sock MYSQL_INCLUDE => MYSQL_LIBS => Directive => Local Value => Master Value mysql.allow_persistent => On => On mysql.connect_timeout => 60 => 60 mysql.default_host => no value => no value mysql.default_password => no value => no value mysql.default_port => no value => no value mysql.default_socket => no value => no value mysql.default_user => no value => no value mysql.max_links => Unlimited => Unlimited mysql.max_persistent => Unlimited => Unlimited mysql.trace_mode => Off => Off oci8 OCI8 Support => enabled Revision => $Revision: 1.183.2.5 $ Oracle Version => 8.1 Compile-time ORACLE_HOME => /appl/oracle/product/8.1.6 Libraries Used => openssl OpenSSL support => enabled OpenSSL Version => OpenSSL 0.9.6c 21 dec 2001 overload User-Space Object Overloading Support => enabled pcre PCRE (Perl Compatible Regular Expressions) Support => enabled PCRE Library Version => 4.3 21-May-2003 posix Revision => $Revision: 1.51.2.2 $ session Session Support => enabled Registered save handlers => files user Directive => Local Value => Master Value session.auto_start => Off => Off session.bug_compat_42 => On => On session.bug_compat_warn => On => On session.cache_expire => 180 => 180 session.cache_limiter => nocache => nocache session.cookie_domain => no value => no value session.cookie_lifetime => 0 => 0 session.cookie_path => / => / session.cookie_secure => Off => Off session.entropy_file => no value => no value session.entropy_length => 0 => 0 session.gc_divisor => 100 => 100 session.gc_maxlifetime => 1440 => 1440 session.gc_probability => 1 => 1 session.name => PHPSESSID => PHPSESSID session.referer_check => no value => no value session.save_handler => files => files session.save_path => /tmp => /tmp session.serialize_handler => php => php session.use_cookies => On => On session.use_only_cookies => Off => Off session.use_trans_sid => On => On sockets Sockets Support => enabled standard Regex Library => Bundled library enabled Dynamic Library Support => enabled Path to sendmail => /usr/sbin/sendmail -t -i Directive => Local Value => Master Value assert.active => 1 => 1 assert.bail => 0 => 0 assert.callback => no value => no value assert.quiet_eval => 0 => 0 assert.warning => 1 => 1 auto_detect_line_endings => 0 => 0 default_socket_timeout => 60 => 60 safe_mode_allowed_env_vars => PHP_ => PHP_ safe_mode_protected_env_vars => LD_LIBRARY_PATH => LD_LIBRARY_PATH url_rewriter.tags => a=href,area=href,frame=src,input=src,form=fakeentry => a=href,area=href,frame=src,input=src,form=fakeentry user_agent => no value => no value tokenizer Tokenizer Support => enabled wddx WDDX Support => enabled WDDX Session Serializer => enabled xml XML Support => active XML Namespace Support => active EXPAT Version => 1.95.6 zlib ZLib Support => enabled Compiled Version => 1.1.4 Linked Version => 1.1.4 Directive => Local Value => Master Value zlib.output_compression => Off => Off zlib.output_compression_level => -1 => -1 zlib.output_handler => no value => no value Additional Modules Module Name Environment Variable => Value CC => gcc CONTENT_LENGTH => CONTENT_TYPE => LD_LIBRARY_PATH => /Team/local/lib:/usr/lib:/usr/openwin/lib:/usr/dt/lib:/usr/lib:/appl/oracle/product/8.1.6/lib:/appl/oracle/product/8.1.6/network/lib ORACLE_HOME => /appl/oracle/product/8.1.6 PATH => /usr/users/mauchm/bin:/usr/bin/posix:/usr/local/bin:/usr/bin:/usr/bin/X11:/usr/dt/bin:/Team/scripts:/Team/bin:/Team/sss/scripts:/Team/sss/bin:/Team/scripts/nko:/Team/scripts/nko/cm4nuss:/sbin:/usr/sbin:/usr/local/sbin:/Team/local/bin:.:/usr/local/bin:/appl/oracle/product/8.1.6/bin:. PATH_TRANSLATED => QUERY_STRING => REDIRECT_STATUS => REQUEST_METHOD => SCRIPT_FILENAME => TEST_PHP_EXECUTABLE => /Team/local/src/php4-STABLE-200310100730/sapi/cli/php TEST_PHP_SRCDIR => /Team/local/src/php4-STABLE-200310100730 PHP Variables Variable => Value PHP_SELF => _SERVER["CC"] => gcc _SERVER["CONTENT_LENGTH"] => _SERVER["CONTENT_TYPE"] => _SERVER["LD_LIBRARY_PATH"] => /Team/local/lib:/usr/lib:/usr/openwin/lib:/usr/dt/lib:/usr/lib:/appl/oracle/product/8.1.6/lib:/appl/oracle/product/8.1..6/network/lib _SERVER["ORACLE_HOME"] => /appl/oracle/product/8.1.6 _SERVER["PATH"] => /usr/users/mauchm/bin:/usr/bin/posix:/usr/local/bin:/usr/bin:/usr/bin/X11:/usr/dt/bin:/Team/scripts:/Team/bin:/Team/sss/scripts:/Team/sss/bin:/Team/scripts/nko:/Team/scripts/nko/cm4nuss:/sbin:/usr/sbin:/usr/local/sbin:/Team/local/bin:.:/usr/local/bin:/appl/oracle/product/8.1.6/bin:. _SERVER["PATH_TRANSLATED"] => _SERVER["QUERY_STRING"] => _SERVER["REDIRECT_STATUS"] => _SERVER["REQUEST_METHOD"] => _SERVER["SCRIPT_FILENAME"] => _SERVER["TEST_PHP_EXECUTABLE"] => /Team/local/src/php4-STABLE-200310100730/sapi/cli/php _SERVER["TEST_PHP_SRCDIR"] => /Team/local/src/php4-STABLE-200310100730 _SERVER["PHP_SELF"] => _SERVER["SCRIPT_NAME"] => _SERVER["DOCUMENT_ROOT"] => _SERVER["argv"] => Array ( ) _SERVER["argc"] => 0 _ENV["CC"] => gcc _ENV["CONTENT_LENGTH"] => _ENV["CONTENT_TYPE"] => _ENV["LD_LIBRARY_PATH"] => /Team/local/lib:/usr/lib:/usr/openwin/lib:/usr/dt/lib:/usr/lib:/appl/oracle/product/8.1.6/lib:/appl/oracle/product/8.1.6/network/lib _ENV["ORACLE_HOME"] => /appl/oracle/product/8.1.6 _ENV["PATH"] => /usr/users/mauchm/bin:/usr/bin/posix:/usr/local/bin:/usr/bin:/usr/bin/X11:/usr/dt/bin:/Team/scripts:/Team/bin:/Team/sss/scripts:/Team/sss/bin:/Team/scripts/nko:/Team/scripts/nko/cm4nuss:/sbin:/usr/sbin:/usr/local/sbin:/Team/local/bin:.:/usr/local/bin:/appl/oracle/product/8.1.6/bin:. _ENV["PATH_TRANSLATED"] => _ENV["QUERY_STRING"] => _ENV["REDIRECT_STATUS"] => _ENV["REQUEST_METHOD"] => _ENV["SCRIPT_FILENAME"] => _ENV["TEST_PHP_EXECUTABLE"] => /Team/local/src/php4-STABLE-200310100730/sapi/cli/php _ENV["TEST_PHP_SRCDIR"] => /Team/local/src/php4-STABLE-200310100730 PHP License This program is free software; you can redistribute it and/or modify it under the terms of the PHP License as published by the PHP Group and included in the distribution in the file: LICENSE This program is distributed in the hope that it will be useful, but WITHOUT ANY WARRANTY; without even the implied warranty of MERCHANTABILITY or FITNESS FOR A PARTICULAR PURPOSE. If you did not receive a copy of the PHP license, or have any questions about PHP licensing, please contact license@php.net.

« previous php.qa (#15712) next »