Test results for 4.3.5RC3 on Solaris

From: Date: Tue, 17 Feb 2004 18:43:42 +0000
Subject: Test results for 4.3.5RC3 on Solaris
Groups: php.qa 
Request: Send a blank email to php-qa+get-15974@lists.php.net to get a copy of this message
===================================================================== FAILED TEST SUMMARY --------------------------------------------------------------------- Testing $argc and $argv handling (GET) [tests/basic/011.phpt] Bug #25547 (error_handler and array index with function call) [tests/lang/bug25547.phpt] Gettext basic test [ext/gettext/tests/gettext_basic.phpt] Bug #25665 (var_dump () hangs on Nan and INF) [ext/standard/tests/math/bug25665.phpt] wddx deserialization test [ext/wddx/tests/001.phpt] ===================================================================== ===================================================================== TEST RESULT SUMMARY --------------------------------------------------------------------- Exts skipped : 71 Exts tested : 16 --------------------------------------------------------------------- Number of tests : 578 Tests skipped : 248 (42.9%) Tests warned : 0 ( 0.0%) Tests failed : 5 ( 0.9%) Tests passed : 325 (56.2%) --------------------------------------------------------------------- Time taken : 169 seconds ===================================================================== ================================================================================ /export/home/Team/local/src/php-4.3.5RC3/tests/basic/011.phpt ================================================================================ ---- EXPECTED OUTPUT 0: ab 1: cd 2: ef 3: 123 4: test ---- ACTUAL OUTPUT PHP Notice: Undefined index: argc in /export/home/Team/local/src/php-4.3.5RC3/tests/basic/011.php on line 4 PHP Notice: Undefined index: argv in /export/home/Team/local/src/php-4.3.5RC3/tests/basic/011.php on line 5 Content-type: text/html X-Powered-By: PHP/4.3.5RC3 ---- FAILED ================================================================================ 001- 0: ab 001+ PHP Notice: Undefined index: argc in /export/home/Team/local/src/php-4.3.5RC3/tests/basic/011.php on line 4 002- 1: cd 002+ PHP Notice: Undefined index: argv in /export/home/Team/local/src/php-4.3.5RC3/tests/basic/011.php on line 5 003- 2: ef 003+ Content-type: text/html 004- 3: 123 004+ X-Powered-By: PHP/4.3.5RC3 005- 4: test ================================================================================ ================================================================================ /export/home/Team/local/src/php-4.3.5RC3/tests/lang/bug25547.phpt ================================================================================ ---- EXPECTED OUTPUT handler(Undefined index: foo) Array ( [foo] => 1 ) Done ---- ACTUAL OUTPUT handler(Undefined index: foo) Array ( [(o] => 1 ) Done ---- FAILED ================================================================================ 004- [foo] => 1 004+ [(o] => 1 ================================================================================ ================================================================================ /export/home/Team/local/src/php-4.3.5RC3/ext/gettext/tests/gettext_basic.phpt ================================================================================ ---- EXPECTED OUTPUT Perustesti Perustesti ---- ACTUAL OUTPUT Basic test Basic test ---- FAILED ================================================================================ 001- Perustesti 001+ Basic test 002- Perustesti 002+ Basic test ================================================================================ ================================================================================ /export/home/Team/local/src/php-4.3.5RC3/ext/standard/tests/math/bug25665.phpt ================================================================================ ---- EXPECTED OUTPUT float(NAN) float(-INF) ---- ACTUAL OUTPUT float(0) float(-INF) ---- FAILED ================================================================================ 001- float(NAN) 001+ float(0) ================================================================================ ================================================================================ /export/home/Team/local/src/php-4.3.5RC3/ext/wddx/tests/001.phpt ================================================================================ ---- EXPECTED OUTPUT array(11) { ["aNull"]=> NULL ["aString"]=> string(8) "a string" ["aNumber"]=> float(-12.456) ["aDateTime"]=> int(897600732) ["aDateTime2"]=> int(329607132) ["aDateTime3"]=> string(19) "2040-06-12T04:32:12" ["aBoolean"]=> bool(true) ["anArray"]=> array(2) { [0]=> int(10) [1]=> string(14) "second element" } ["aBinary"]=> string(11) "binary data" ["anObject"]=> array(2) { ["s"]=> string(8) "a string" ["n"]=> float(-12.456) } ["aRecordset"]=> array(2) { ["NAME"]=> array(2) { [0]=> string(8) "John Doe" [1]=> string(8) "Jane Doe" } ["AGE"]=> array(2) { [0]=> int(34) [1]=> int(31) } } } ---- ACTUAL OUTPUT array(11) { ["aNull"]=> NULL ["aString"]=> string(8) "a string" ["aNumber"]=> float(-12.456) ["aDateTime"]=> int(897651132) ["aDateTime2"]=> int(329657532) ["aDateTime3"]=> string(19) "2040-06-12T04:32:12" ["aBoolean"]=> bool(true) ["anArray"]=> array(2) { [0]=> int(10) [1]=> string(14) "second element" } ["aBinary"]=> string(11) "binary data" ["anObject"]=> array(2) { ["s"]=> string(8) "a string" ["n"]=> float(-12.456) } ["aRecordset"]=> array(2) { ["NAME"]=> array(2) { [0]=> string(8) "John Doe" [1]=> string(8) "Jane Doe" } ["AGE"]=> array(2) { [0]=> int(34) [1]=> int(31) } } } ---- FAILED ================================================================================ 009- int(897600732) 009+ int(897651132) 011- int(329607132) 011+ int(329657532) ================================================================================ ================================================================================ BUILD ENVIRONMENT ================================================================================ OS: SunOS - SunOS bnsisr13 5.7 Generic_106541-15 sun4us Automake: automake (GNU automake) 1.7.3 Written by Tom Tromey <tromey@redhat.com>. Copyright 2003 Free Software Foundation, Inc. This is free software; see the source for copying conditions. There is NO warranty; not even for MERCHANTABILITY or FITNESS FOR A PARTICULAR PURPOSE. Autoconf: autoconf (GNU Autoconf) 2.57 Written by David J. MacKenzie and Akim Demaille. Copyright 2002 Free Software Foundation, Inc. This is free software; see the source for copying conditions. There is NO warranty; not even for MERCHANTABILITY or FITNESS FOR A PARTICULAR PURPOSE. Libtool: ltmain.sh (GNU libtool) 1.4.3 (1.922.2.110 2002/10/23 01:39:54) Compiler: Reading specs from /usr/local/lib/gcc-lib/sparc-sun-solaris2.7/2.95.3/specs gcc version 2.95.3 20010315 (release) Bison: GNU Bison version 1.28 Libraries: libintl.so.2 => /Team/local/lib/libintl.so.2 libc.so.1 => /usr/lib/libc.so.1 libt1.so.1 => /usr/local/lib/libt1.so.1 libfreetype.so.6 => /usr/local/lib/libfreetype.so.6 libpng.so.3 => /Team/local/lib/libpng.so.3 libresolv.so.2 => /usr/lib/libresolv.so.2 libm.so.1 => /usr/lib/libm.so.1 libdl.so.1 => /usr/lib/libdl.so.1 libnsl.so.1 => /usr/lib/libnsl.so.1 libsocket.so.1 => /usr/lib/libsocket.so.1 libgen.so.1 => /usr/lib/libgen.so.1 libsched.so.1 => /usr/lib/libsched.so.1 libclntsh.so.8.0 => /appl/oracle/product/8.1.7/lib/libclntsh.so.8.0 libmp.so.2 => /usr/lib/libmp.so.2 libwtc8.so => /appl/oracle/product/8.1.7/lib/libwtc8.so libaio.so.1 => /usr/lib/libaio.so.1 /usr/platform/FJSV,GPUS/lib/libc_psr.so.1 ================================================================================ PHPINFO ================================================================================ phpinfo() PHP Version => 4.3.5RC3 System => SunOS bnsisr13 5.7 Generic_106541-15 sun4us Build Date => Feb 17 2004 16:16:57 Configure Command => './configure' '--prefix=/Team/local' '--enable-magic-quotes' '--enable-trans-sid' '--enable-wddx' '--enable-ftp' '--with-oci8' '--enable-calendar' '--with-gettext=/Team/local' '--enable-memory-limit' '--with-gd' '--with-zlib=/Team/local' '--enable-exif' '--enable-gd-native-tt' '--with-t1lib=/Team/local' '--with-jpeg-dir=/Team/local' '--with-png-dir=/Team/local' '--with-ttf' '--with-freetype-dir=/Team/local' '--without-mysql' Server API => Command Line Interface Virtual Directory Support => disabled Configuration File (php.ini) Path => /export/home/Team/local/lib/php-cli.ini PHP API => 20020918 PHP Extension => 20020429 Zend Extension => 20021010 Debug Build => no Thread Safety => disabled Registered PHP Streams => php, http, ftp, compress.zlib This program makes use of the Zend Scripting Language Engine: Zend Engine v1.3.0, Copyright (c) 1998-2004 Zend Technologies _______________________________________________________________________ Configuration PHP Core Directive => Local Value => Master Value allow_call_time_pass_reference => On => On allow_url_fopen => On => On always_populate_raw_post_data => Off => Off arg_separator.input => & => & arg_separator.output => & => & asp_tags => Off => Off auto_append_file => no value => no value auto_prepend_file => no value => no value browscap => no value => no value default_charset => no value => no value default_mimetype => text/html => text/html define_syslog_variables => Off => Off disable_classes => no value => no value disable_functions => no value => no value display_errors => On => On display_startup_errors => Off => Off doc_root => no value => no value docref_ext => no value => no value docref_root => no value => no value enable_dl => On => On error_append_string => no value => no value error_log => no value => no value error_prepend_string => no value => no value error_reporting => 2039 => 2039 expose_php => On => On extension_dir => ./ => ./ file_uploads => On => On gpc_order => GPC => GPC highlight.bg => #FFFFFF => #FFFFFF highlight.comment => #FF8000 => #FF8000 highlight.default => #0000BB => #0000BB highlight.html => #000000 => #000000 highlight.keyword => #007700 => #007700 highlight.string => #DD0000 => #DD0000 html_errors => Off => On ignore_repeated_errors => Off => Off ignore_repeated_source => Off => Off ignore_user_abort => Off => Off implicit_flush => On => Off include_path => .:/Team/local/lib/php => .:/Team/local/lib/php log_errors => Off => Off log_errors_max_len => 1024 => 1024 magic_quotes_gpc => On => On magic_quotes_runtime => Off => Off magic_quotes_sybase => Off => Off max_execution_time => 0 => 30 max_input_time => 60 => 60 memory_limit => 100M => 100M open_basedir => no value => no value output_buffering => 0 => no value output_handler => no value => no value post_max_size => 8M => 8M precision => 12 => 12 register_argc_argv => On => On register_globals => Off => Off report_memleaks => On => On safe_mode => Off => Off safe_mode_exec_dir => no value => no value safe_mode_gid => Off => Off safe_mode_include_dir => no value => no value sendmail_from => me@localhost.com => me@localhost.com sendmail_path => /usr/lib/sendmail -t -i => /usr/lib/sendmail -t -i serialize_precision => 100 => 100 short_open_tag => On => On SMTP => localhost => localhost smtp_port => 25 => 25 sql.safe_mode => Off => Off track_errors => Off => Off unserialize_callback_func => no value => no value upload_max_filesize => 2M => 2M upload_tmp_dir => no value => no value user_dir => no value => no value variables_order => EGPCS => EGPCS xmlrpc_error_number => 0 => 0 xmlrpc_errors => Off => Off y2k_compliance => On => On calendar Calendar support => enabled ctype ctype functions => enabled exif EXIF Support => enabled EXIF Version => 1.4 $Id: exif.c,v 1.118.2.27 2003/12/17 09:08:37 helly Exp $ Supported EXIF Version => 0220 Supported filetypes => JPEG,TIFF ftp FTP support => enabled gd GD Support => enabled GD Version => bundled (2.0.17 compatible) FreeType Support => enabled FreeType Linkage => with freetype T1Lib Support => enabled GIF Read Support => enabled JPG Support => enabled PNG Support => enabled WBMP Support => enabled XBM Support => enabled gettext GetText Support => enabled oci8 OCI8 Support => enabled Revision => $Revision: 1.183.2.12 $ Oracle Version => 8.1 Compile-time ORACLE_HOME => /appl/oracle/product/8.1.7 Libraries Used => overload User-Space Object Overloading Support => enabled pcre PCRE (Perl Compatible Regular Expressions) Support => enabled PCRE Library Version => 4.5 01-December-2003 posix Revision => $Revision: 1.51.2.2 $ session Session Support => enabled Registered save handlers => files user Directive => Local Value => Master Value session.auto_start => Off => Off session.bug_compat_42 => On => On session.bug_compat_warn => On => On session.cache_expire => 180 => 180 session.cache_limiter => nocache => nocache session.cookie_domain => no value => no value session.cookie_lifetime => 0 => 0 session.cookie_path => / => / session.cookie_secure => Off => Off session.entropy_file => no value => no value session.entropy_length => 0 => 0 session.gc_divisor => 100 => 100 session.gc_maxlifetime => 1440 => 1440 session.gc_probability => 1 => 1 session.name => PHPSESSID => PHPSESSID session.referer_check => no value => no value session.save_handler => files => files session.save_path => /tmp => /tmp session.serialize_handler => php => php session.use_cookies => On => On session.use_only_cookies => Off => Off session.use_trans_sid => Off => Off standard Regex Library => Bundled library enabled Dynamic Library Support => enabled Path to sendmail => /usr/lib/sendmail -t -i Directive => Local Value => Master Value assert.active => 1 => 1 assert.bail => 0 => 0 assert.callback => no value => no value assert.quiet_eval => 0 => 0 assert.warning => 1 => 1 auto_detect_line_endings => 0 => 0 default_socket_timeout => 60 => 60 safe_mode_allowed_env_vars => PHP_ => PHP_ safe_mode_protected_env_vars => LD_LIBRARY_PATH => LD_LIBRARY_PATH url_rewriter.tags => a=href,area=href,frame=src,input=src,form=,fieldset= => a=href,area=href,frame=src,input=src,form=,fieldset= user_agent => no value => no value tokenizer Tokenizer Support => enabled wddx WDDX Support => enabled WDDX Session Serializer => enabled xml XML Support => active XML Namespace Support => active EXPAT Version => 1.95.6 zlib ZLib Support => enabled Compiled Version => 1.1.4 Linked Version => 1.1.4 Directive => Local Value => Master Value zlib.output_compression => Off => Off zlib.output_compression_level => -1 => -1 zlib.output_handler => no value => no value Additional Modules Module Name Environment Variable => Value CC => gcc CFLAGS => -Wall -prefer-non-pic -static CONTENT_LENGTH => CONTENT_TYPE => LD_LIBRARY_PATH => /Team/local/lib:/usr/local/lib:/appl/oracle/product/8.1.7/lib:/usr/openwin/lib:/usr/X/lib:/usr/dt/lib:/usr/lib:/usr/ucblib MAKEFLAGS => ORACLE_HOME => /appl/oracle/product/8.1.7 PATH => /export/home/mauchm/bin:/Team/scripts:/Team/bin:/Team/local/bin:/usr/xpg4/bin:/usr/ccs/bin:/usr/ucb:/appl/oracle/product/8.1.7/bin:/usr/local/bin:/usr/bin:/bin:/usr/X/bin:/usr/openwin/bin:/usr/dt/bin::/Team/sss/scripts:/Team/sss/bin:/usr/local/sbin:/usr/sbin:/sbin:. PATH_TRANSLATED => QUERY_STRING => REDIRECT_STATUS => REQUEST_METHOD => SCRIPT_FILENAME => SGS_SUPPORT => libmakestate.so.1 TEST_PHP_EXECUTABLE => /export/home/Team/local/src/php-4.3.5RC3/sapi/cli/php TEST_PHP_SRCDIR => /export/home/Team/local/src/php-4.3.5RC3 VIRTUAL_ROOT => / PHP Variables Variable => Value _SERVER["CC"] => gcc _SERVER["CFLAGS"] => -Wall -prefer-non-pic -static _SERVER["CONTENT_LENGTH"] => _SERVER["CONTENT_TYPE"] => _SERVER["LD_LIBRARY_PATH"] => /Team/local/lib:/usr/local/lib:/appl/oracle/product/8.1.7/lib:/usr/openwin/lib:/usr/X/lib:/usr/dt/lib:/usr/lib:/usr/ucblib _SERVER["MAKEFLAGS"] => _SERVER["ORACLE_HOME"] => /appl/oracle/product/8.1.7 _SERVER["PATH"] => /export/home/mauchm/bin:/Team/scripts:/Team/bin:/Team/local/bin:/usr/xpg4/bin:/usr/ccs/bin:/usr/ucb:/appl/oracle/product/8.1.7/bin:/usr/local/bin:/usr/bin:/bin:/usr/X/bin:/usr/openwin/bin:/usr/dt/bin::/Team/sss/scripts:/Team/sss/bin:/usr/local/sbin:/usr/sbin:/sbin:. _SERVER["PATH_TRANSLATED"] => _SERVER["QUERY_STRING"] => _SERVER["REDIRECT_STATUS"] => _SERVER["REQUEST_METHOD"] => _SERVER["SCRIPT_FILENAME"] => _SERVER["SGS_SUPPORT"] => libmakestate.so.1 _SERVER["TEST_PHP_EXECUTABLE"] => /export/home/Team/local/src/php-4.3.5RC3/sapi/cli/php _SERVER["TEST_PHP_SRCDIR"] => /export/home/Team/local/src/php-4.3.5RC3 _SERVER["VIRTUAL_ROOT"] => / _SERVER["PHP_SELF"] => _SERVER["SCRIPT_NAME"] => _SERVER["DOCUMENT_ROOT"] => _SERVER["argv"] => Array ( ) _SERVER["argc"] => 0 _ENV["CC"] => gcc _ENV["CFLAGS"] => -Wall -prefer-non-pic -static _ENV["CONTENT_LENGTH"] => _ENV["CONTENT_TYPE"] => _ENV["LD_LIBRARY_PATH"] => /Team/local/lib:/usr/local/lib:/appl/oracle/product/8.1.7/lib:/usr/openwin/lib:/usr/X/lib:/usr/dt/lib:/usr/lib:/usr/ucblib _ENV["MAKEFLAGS"] => _ENV["ORACLE_HOME"] => /appl/oracle/product/8.1.7 _ENV["PATH"] => /export/home/mauchm/bin:/Team/scripts:/Team/bin:/Team/local/bin:/usr/xpg4/bin:/usr/ccs/bin:/usr/ucb:/appl/oracle/product/8.1.7/bin:/usr/local/bin:/usr/bin:/bin:/usr/X/bin:/usr/openwin/bin:/usr/dt/bin::/Team/sss/scripts:/Team/sss/bin:/usr/local/sbin:/usr/sbin:/sbin:. _ENV["PATH_TRANSLATED"] => _ENV["QUERY_STRING"] => _ENV["REDIRECT_STATUS"] => _ENV["REQUEST_METHOD"] => _ENV["SCRIPT_FILENAME"] => _ENV["SGS_SUPPORT"] => libmakestate.so.1 _ENV["TEST_PHP_EXECUTABLE"] => /export/home/Team/local/src/php-4.3.5RC3/sapi/cli/php _ENV["TEST_PHP_SRCDIR"] => /export/home/Team/local/src/php-4.3.5RC3 _ENV["VIRTUAL_ROOT"] => / PHP License This program is free software; you can redistribute it and/or modify it under the terms of the PHP License as published by the PHP Group and included in the distribution in the file: LICENSE This program is distributed in the hope that it will be useful, but WITHOUT ANY WARRANTY; without even the implied warranty of MERCHANTABILITY or FITNESS FOR A PARTICULAR PURPOSE. If you did not receive a copy of the PHP license, or have any questions about PHP licensing, please contact license@php.net.

« previous php.qa (#15974) next »