Test results for 4.3.5RC3 on Tru64
| From: | Michael Mauch | Date: | Tue, 17 Feb 2004 18:44:17 +0000 |
| Subject: | Test results for 4.3.5RC3 on Tru64 | ||
| Groups: | php.qa | ||
| Request: | Send a blank email to php-qa+get-15975@lists.php.net to get a copy of this message | ||
=====================================================================
FAILED TEST SUMMARY
---------------------------------------------------------------------
Bug #24054 (Assignment operator *= broken) [tests/lang/bug24054.phpt]
Bug #25547 (error_handler and array index with function call) [tests/lang/bug25547.phpt]
Gettext basic test [ext/gettext/tests/gettext_basic.phpt]
Bug #26862 (ob_flush() before output_reset_rewrite_vars() results in data loss)
[ext/session/tests/bug26862.phpt]
Bug #12556 (fgetcsv() ignores lengths when quotes not closed)
[ext/standard/tests/file/bug12556.phpt]
Bug #22382 (fgetcsv() does not handle escaped quotes correctly)
[ext/standard/tests/file/bug22382.phpt]
Bug #26003 (fgetcsv() is not binary-safe) [ext/standard/tests/file/bug26003.phpt]
Bug #26634 (fgetcsv() incorrect handling of multiline entries with backslashes)
[ext/standard/tests/file/bug26634.phpt]
various fgetcsv() functionality tests [ext/standard/tests/file/fgetcsv.phpt]
fgetcsv() with tab delimited fields (BUG #8258) [ext/standard/tests/general_functions/004.phpt]
Simple math tests [ext/standard/tests/math/abs.phpt]
Bug #21523 number_format tries to allocate negative amount of memory
[ext/standard/tests/math/bug21523.phpt]
Bug #25665 (var_dump () hangs on Nan and INF) [ext/standard/tests/math/bug25665.phpt]
log() tests [ext/standard/tests/math/log.phpt]
Various pow() tests [ext/standard/tests/math/pow.phpt]
Simple math tests [ext/standard/tests/math/round.phpt]
microtime() function [ext/standard/tests/time/001.phpt] (warn: system dependent)
strtotime() function [ext/standard/tests/time/002.phpt]
Bug #13142 strtotime handling of "M d H:i:s Y" format
[ext/standard/tests/time/bug13142.phpt]
mktime() [ext/standard/tests/time/mktime.phpt]
wddx deserialization test [ext/wddx/tests/001.phpt]
=====================================================================
=====================================================================
TEST RESULT SUMMARY
---------------------------------------------------------------------
Exts skipped : 71
Exts tested : 16
---------------------------------------------------------------------
Number of tests : 578
Tests skipped : 248 (42.9%)
Tests warned : 1 ( 0.2%)
Tests failed : 20 ( 3.5%)
Tests passed : 309 (53.5%)
---------------------------------------------------------------------
Time taken : 195 seconds
=====================================================================
================================================================================
/Team/local/src/php-4.3.5RC3/tests/lang/bug24054.phpt
================================================================================
---- EXPECTED OUTPUT
float(1.001E+10)
float(1.001E+10)
---- ACTUAL OUTPUT
int(10010000000)
int(10010000000)
---- FAILED
================================================================================
001- float(1.001E+10)
001+ int(10010000000)
002- float(1.001E+10)
002+ int(10010000000)
================================================================================
================================================================================
/Team/local/src/php-4.3.5RC3/tests/lang/bug25547.phpt
================================================================================
---- EXPECTED OUTPUT
handler(Undefined index: foo)
Array
(
[foo] => 1
)
Done
---- ACTUAL OUTPUT
handler(Undefined index: foo)
Array
(
[( o] => 1
)
Done
---- FAILED
================================================================================
004- [foo] => 1
004+ [( o] => 1
================================================================================
================================================================================
/Team/local/src/php-4.3.5RC3/ext/gettext/tests/gettext_basic.phpt
================================================================================
---- EXPECTED OUTPUT
Perustesti
Perustesti
---- ACTUAL OUTPUT
Basic test
Basic test
---- FAILED
================================================================================
001- Perustesti
001+ Basic test
002- Perustesti
002+ Basic test
================================================================================
================================================================================
/Team/local/src/php-4.3.5RC3/ext/session/tests/bug26862.phpt
================================================================================
---- EXPECTED OUTPUT
<a href="file.php?var=value">link</a><a
href="file.php">link</a>
---- ACTUAL OUTPUT
<a
href="file.php?PHPSESSID=d0027afcf3b0e820c9353871267ab3f3&var=value">link</a><a
href="file.php">link</a>
---- FAILED
================================================================================
001- <a href="file.php?var=value">link</a><a
href="file.php">link</a>
001+ <a
href="file.php?PHPSESSID=d0027afcf3b0e820c9353871267ab3f3&var=value">link</a><a
href="file.php">link</a>
================================================================================
================================================================================
/Team/local/src/php-4.3.5RC3/ext/standard/tests/file/bug12556.phpt
================================================================================
---- EXPECTED OUTPUT
array(4) {
[0]=>
string(1) "6"
[1]=>
string(1) "7"
[2]=>
string(1) "8"
[3]=>
string(5) "line1"
}
array(4) {
[0]=>
string(1) "1"
[1]=>
string(1) "2"
[2]=>
string(1) "3"
[3]=>
string(186) "line2
2,4,5,line3
2,4,5,line3
2,4,5,line3
2,4,5,line3
2,4,5,line3
2,4,5,line3
2,4,5,line3
2,4,5,line3
2,4,5,line3
2,4,5,line3
2,4,5,line3
2,4,5,line3
2,4,5,line3
2,4,5,line3
2,4,5,line3
"
}
---- ACTUAL OUTPUT
---- FAILED
================================================================================
001- array(4) {
001+
002- [0]=>
003- string(1) "6"
004- [1]=>
005- string(1) "7"
006- [2]=>
007- string(1) "8"
008- [3]=>
009- string(5) "line1"
010- }
011- array(4) {
012- [0]=>
013- string(1) "1"
014- [1]=>
015- string(1) "2"
016- [2]=>
017- string(1) "3"
018- [3]=>
019- string(186) "line2
020- 2,4,5,line3
021- 2,4,5,line3
022- 2,4,5,line3
023- 2,4,5,line3
024- 2,4,5,line3
025- 2,4,5,line3
026- 2,4,5,line3
027- 2,4,5,line3
028- 2,4,5,line3
029- 2,4,5,line3
030- 2,4,5,line3
031- 2,4,5,line3
032- 2,4,5,line3
033- 2,4,5,line3
034- 2,4,5,line3
035- "
036- }
================================================================================
================================================================================
/Team/local/src/php-4.3.5RC3/ext/standard/tests/file/bug22382.phpt
================================================================================
---- EXPECTED OUTPUT
array(6) {
[0]=>
string(3) "One"
[1]=>
string(7) "\"Two\""
[2]=>
string(7) "Three\""
[3]=>
string(4) "Four"
[4]=>
string(2) "\\"
[5]=>
string(28) "\\\\\\\\\\\\\\\\\\\\\\\"\\\\"
}
---- ACTUAL OUTPUT
---- FAILED
================================================================================
001- array(6) {
001+
002- [0]=>
003- string(3) "One"
004- [1]=>
005- string(7) "\"Two\""
006- [2]=>
007- string(7) "Three\""
008- [3]=>
009- string(4) "Four"
010- [4]=>
011- string(2) "\\"
012- [5]=>
013- string(28) "\\\\\\\\\\\\\\\\\\\\\\\"\\\\"
014- }
================================================================================
================================================================================
/Team/local/src/php-4.3.5RC3/ext/standard/tests/file/bug26003.phpt
================================================================================
---- EXPECTED OUTPUT
array(2) {
[0]=>
string(3) "abc"
[1]=>
string(3) "d e"
}
---- ACTUAL OUTPUT
---- FAILED
================================================================================
001- array(2) {
001+
002- [0]=>
003- string(3) "abc"
004- [1]=>
005- string(3) "d e"
006- }
================================================================================
================================================================================
/Team/local/src/php-4.3.5RC3/ext/standard/tests/file/bug26634.phpt
================================================================================
---- EXPECTED OUTPUT
Array
(
[0] =>
[1] =>
[2] => 971221
[3] => 1
)
Array
(
[0] =>
[1] =>
[2] => 950707
[3] => \\
\\
)
Array
(
[0] =>
[1] =>
[2] => 999637
[3] => ERYC 250
)
---- ACTUAL OUTPUT
---- FAILED
================================================================================
001- Array
001+
002- (
003- [0] =>
004- [1] =>
005- [2] => 971221
006- [3] => 1
007- )
008- Array
009- (
010- [0] =>
011- [1] =>
012- [2] => 950707
013- [3] => \\
014- \\
015- )
016- Array
017- (
018- [0] =>
019- [1] =>
020- [2] => 999637
021- [3] => ERYC 250
022- )
================================================================================
================================================================================
/Team/local/src/php-4.3.5RC3/ext/standard/tests/file/fgetcsv.phpt
================================================================================
---- EXPECTED OUTPUT
array(2) {
[0]=>
string(3) "aaa"
[1]=>
string(3) "bbb"
}
array(2) {
[0]=>
string(3) "aaa"
[1]=>
string(3) "bbb"
}
array(2) {
[0]=>
string(3) "aaa"
[1]=>
string(3) "bbb"
}
array(2) {
[0]=>
string(3) "aaa"
[1]=>
string(3) "bbb"
}
array(2) {
[0]=>
string(3) "aaa"
[1]=>
string(3) "bbb"
}
array(2) {
[0]=>
string(3) "aaa"
[1]=>
string(3) "bbb"
}
array(2) {
[0]=>
string(0) ""
[1]=>
string(0) ""
}
array(2) {
[0]=>
string(3) "aaa"
[1]=>
string(0) ""
}
array(2) {
[0]=>
string(0) ""
[1]=>
string(3) "aaa"
}
array(2) {
[0]=>
string(0) ""
[1]=>
string(0) ""
}
array(2) {
[0]=>
string(2) "\""
[1]=>
string(3) "aaa"
}
array(2) {
[0]=>
string(2) """"
[1]=>
string(0) ""
}
array(1) {
[0]=>
string(7) """,aaa
"
}
array(1) {
[0]=>
string(8) "\"",aaa
"
}
array(2) {
[0]=>
string(3) "aaa"
[1]=>
string(10) "\"bbb,ccc
"
}
array(2) {
[0]=>
string(3) "aaa"
[1]=>
string(6) "bbb "
}
array(2) {
[0]=>
string(3) "aaa"
[1]=>
string(6) "bbb "
}
array(2) {
[0]=>
string(8) "aaa"aaa""
[1]=>
string(6) "bbbbbb"
}
array(2) {
[0]=>
string(10) "aaa"aaa""""
[1]=>
string(3) "bbb"
}
array(2) {
[0]=>
string(8) "aaa"\"a""
[1]=>
string(3) "bbb"
}
array(1) {
[0]=>
string(0) ""
}
---- ACTUAL OUTPUT
---- FAILED
================================================================================
001- array(2) {
001+
002- [0]=>
003- string(3) "aaa"
004- [1]=>
005- string(3) "bbb"
006- }
007- array(2) {
008- [0]=>
009- string(3) "aaa"
010- [1]=>
011- string(3) "bbb"
012- }
013- array(2) {
014- [0]=>
015- string(3) "aaa"
016- [1]=>
017- string(3) "bbb"
018- }
019- array(2) {
020- [0]=>
021- string(3) "aaa"
022- [1]=>
023- string(3) "bbb"
024- }
025- array(2) {
026- [0]=>
027- string(3) "aaa"
028- [1]=>
029- string(3) "bbb"
030- }
031- array(2) {
032- [0]=>
033- string(3) "aaa"
034- [1]=>
035- string(3) "bbb"
036- }
037- array(2) {
038- [0]=>
039- string(0) ""
040- [1]=>
041- string(0) ""
042- }
043- array(2) {
044- [0]=>
045- string(3) "aaa"
046- [1]=>
047- string(0) ""
048- }
049- array(2) {
050- [0]=>
051- string(0) ""
052- [1]=>
053- string(3) "aaa"
054- }
055- array(2) {
056- [0]=>
057- string(0) ""
058- [1]=>
059- string(0) ""
060- }
061- array(2) {
062- [0]=>
063- string(2) "\""
064- [1]=>
065- string(3) "aaa"
066- }
067- array(2) {
068- [0]=>
069- string(2) """"
070- [1]=>
071- string(0) ""
072- }
073- array(1) {
074- [0]=>
075- string(7) """,aaa
076- "
077- }
078- array(1) {
079- [0]=>
080- string(8) "\"",aaa
081- "
082- }
083- array(2) {
084- [0]=>
085- string(3) "aaa"
086- [1]=>
087- string(10) "\"bbb,ccc
088- "
089- }
090- array(2) {
091- [0]=>
092- string(3) "aaa"
093- [1]=>
094- string(6) "bbb "
095- }
096- array(2) {
097- [0]=>
098- string(3) "aaa"
099- [1]=>
100- string(6) "bbb "
101- }
102- array(2) {
103- [0]=>
104- string(8) "aaa"aaa""
105- [1]=>
106- string(6) "bbbbbb"
107- }
108- array(2) {
109- [0]=>
110- string(10) "aaa"aaa""""
111- [1]=>
112- string(3) "bbb"
113- }
114- array(2) {
115- [0]=>
116- string(8) "aaa"\"a""
117- [1]=>
118- string(3) "bbb"
119- }
120- array(1) {
121- [0]=>
122- string(0) ""
123- }
================================================================================
================================================================================
/Team/local/src/php-4.3.5RC3/ext/standard/tests/general_functions/004.phpt
================================================================================
---- EXPECTED OUTPUT
name,value,comment
true,1,boolean true
false,0,boolean false
empty,,nothing
---- ACTUAL OUTPUT
---- FAILED
================================================================================
001- name,value,comment
001+
002- true,1,boolean true
003- false,0,boolean false
004- empty,,nothing
================================================================================
================================================================================
/Team/local/src/php-4.3.5RC3/ext/standard/tests/math/abs.phpt
================================================================================
---- EXPECTED OUTPUT
1,1,0,0
OK
---- ACTUAL OUTPUT
1,1,1,1
Assert failed:
-LONG_MIN+1 === abs(LONG_MIN-1)
Left: int(-9223372036854775807)
Right: int(9223372036854775807)
Assert failed:
-LONG_MIN === abs(LONG_MIN)
Left: int(-9223372036854775808)
Right: float(9.22337203685E+18)
---- FAILED
================================================================================
001- 1,1,0,0
001+ 1,1,1,1
002- OK
002+
003+ Assert failed:
004+ -LONG_MIN+1 === abs(LONG_MIN-1)
005+ Left: int(-9223372036854775807)
006+ Right: int(9223372036854775807)
007+
008+ Assert failed:
009+ -LONG_MIN === abs(LONG_MIN)
010+ Left: int(-9223372036854775808)
011+ Right: float(9.22337203685E+18)
================================================================================
================================================================================
/Team/local/src/php-4.3.5RC3/ext/standard/tests/math/bug21523.phpt
================================================================================
---- EXPECTED OUTPUT
string(2775)
"-2,000.00000000000000000000000000000000000000000000000000000000000000000000000000000000000000000000000000000000000000000000000000000000000000000000000000000000000000000000000000000000000000000000000000000000000000000000000000000000000000000000000000000000000000000000000000000000000000000000000000000000000000000000000000000000000000000000000000000000000000000000000000000000000000000000000000000000000000000000000000000000000000000000000000000000000000000000000000000000000000000000000000000000000000000000000000000000000000000000000000000000000000000000000000000000000000000000000000000000000000000000000000000000000000000000000000000000000000000000000000000000000000000000000000000000000000000000000000000000000000000000000000000000000000000000000000000000000000000000000000000000000000000000000000000000000000000000000000000000000000000000000000000000000000000000000000000000000000000000000000000000000000000000000000000000000000000000000000000000000000000000000000000000000000000000000000000000000000000000000000000000000000000000000000000000000000000000000000000000000000000000000000000000000000000000000000000000000000000000000000000000000000000000000000000000000000000000000000000000000000000000000000000000000000000000000000000000000000000000000000000000000000000000000000000000000000000000000000000000000000000000000000000000000000000000000000000000000000000000000000000000000000000000000000000000000000000000000000000000000000000000000000000000000000000000000000000000000000000000000000000000000000000000000000000000000000000000000000000000000000000000000000000000000000000000000000000000000000000000000000000000000000000000000000000000000000000000000000000000000000000000000000000000000000000000000000000000000000000000000000000000000000000000000000000000000000000000000000000000000000000000000000000000000000000000000000000000000000000000000000000000000000000000000000000000000000000000000000000000000000000000000000000000000000000000000000000000000000000000000000000000000000000000000000000000000000000000000000000000000000000000000000000000000000000000000000000000000000000000000000000000000000000000000000000000000000000000000000000000000000000000000000000000000000000000000000000000000000000000000000000000000000000000000000000000000000000000000000000000000000000000000000000000000000000000000000000000000000000000000000000000000000000000000000000000000000000000000000000000000000000000000000000000000000000000000000000000000000000000000000000000000000000000000000000000000000000000000000000000000000000000000000000000000000000000000000000000000000000000000000000000000000000000000000000000000000000000000000000000000000000000000000000000000000000000000000000000000000000000000000000000000000000000000000000000000000000000000000000000000000000000000000000000"
OK
---- ACTUAL OUTPUT
---- FAILED
================================================================================
001- string(2775)
"-2,000.00000000000000000000000000000000000000000000000000000000000000000000000000000000000000000000000000000000000000000000000000000000000000000000000000000000000000000000000000000000000000000000000000000000000000000000000000000000000000000000000000000000000000000000000000000000000000000000000000000000000000000000000000000000000000000000000000000000000000000000000000000000000000000000000000000000000000000000000000000000000000000000000000000000000000000000000000000000000000000000000000000000000000000000000000000000000000000000000000000000000000000000000000000000000000000000000000000000000000000000000000000000000000000000000000000000000000000000000000000000000000000000000000000000000000000000000000000000000000000000000000000000000000000000000000000000000000000000000000000000000000000000000000000000000000000000000000000000000000000000000000000000000000000000000000000000000000000000000000000000000000000000000000000000000000000000000000000000000000000000000000000000000000000000000000000000000000000000000000000000000000000000000000000000000000000000000000000000000000000000000000000000000000000000000000000000000000000000000000000000000000000000000000000000000000000000000000000000000000000000000000000000000000000000000000000000000000000000000000000000000000000000000000000000000000000000000000000000000000000000000000000000000000000000000000000000000000000000000000000000000000000000000000000000000000000000000000000000000000000000000000000000000000000000000000000000000000000000000000000000000000000000000000000000000000000000000000000000000000000000000000000000000000000000000000000000000000000000000000000000000000000000000000000000000000000000000000000000000000000000000000000000000000000000000000000000000000000000000000000000000000000000000000000000000000000000000000000000000000000000000000000000000000000000000000000000000000000000000000000000000000000000000000000000000000000000000000000000000000000000000000000000000000000000000000000000000000000000000000000000000000000000000000000000000000000000000000000000000000000000000000000000000000000000000000000000000000000000000000000000000000000000000000000000000000000000000000000000000000000000000000000000000000000000000000000000000000000000000000000000000000000000000000000000000000000000000000000000000000000000000000000000000000000000000000000000000000000000000000000000000000000000000000000000000000000000000000000000000000000000000000000000000000000000000000000000000000000000000000000000000000000000000000000000000000000000000000000000000000000000000000000000000000000000000000000000000000000000000000000000000000000000000000000000000000000000000000000000000000000000000000000000000000000000000000000000000000000000000000000000000000000000000000000000000000000000000000000000000000000000000000000000"
001+
002- OK
================================================================================
================================================================================
/Team/local/src/php-4.3.5RC3/ext/standard/tests/math/bug25665.phpt
================================================================================
---- EXPECTED OUTPUT
float(NAN)
float(-INF)
---- ACTUAL OUTPUT
float(0)
float(-1.79769313486E+308)
---- FAILED
================================================================================
001- float(NAN)
001+ float(0)
002- float(-INF)
002+ float(-1.79769313486E+308)
================================================================================
================================================================================
/Team/local/src/php-4.3.5RC3/ext/standard/tests/math/log.phpt
================================================================================
---- EXPECTED OUTPUT
On failure, please mail result to php-dev@lists.php.net
200
50
50
50
50
50
50
50
50
50
---- ACTUAL OUTPUT
On failure, please mail result to php-dev@lists.php.net
200
---- FAILED
================================================================================
003- 50
004- 50
005- 50
006- 50
007- 50
008- 50
009- 50
010- 50
011- 50
================================================================================
================================================================================
/Team/local/src/php-4.3.5RC3/ext/standard/tests/math/pow.phpt
================================================================================
---- EXPECTED OUTPUT
1,1,0,0
On failure, please mail result to php-dev@lists.php.net
OK
---- ACTUAL OUTPUT
1,1,1,1
On failure, please mail result to php-dev@lists.php.net
Assert failed:
TRUE === is_infinite(pow(0,-2))
Left: bool(true)
Right: bool(false)
Assert failed:
TRUE === is_infinite(pow(0,-1))
Left: bool(true)
Right: bool(false)
Assert failed:
TRUE === is_infinite(pow(0,-2.0))
Left: bool(true)
Right: bool(false)
Assert failed:
TRUE === is_infinite(pow(0,-1.0))
Left: bool(true)
Right: bool(false)
Assert failed:
TRUE === is_infinite(pow(0.0,-2.0))
Left: bool(true)
Right: bool(false)
Assert failed:
TRUE === is_infinite(pow(0.0,-1.0))
Left: bool(true)
Right: bool(false)
Assert failed:
TRUE === is_infinite(pow( 0.0,-2))
Left: bool(true)
Right: bool(false)
Assert failed:
TRUE === is_infinite(pow( 0.0,-1))
Left: bool(true)
Right: bool(false)
Assert failed:
LONG_MAX-1 === pow(LONG_MAX-1,1)
Left: int(9223372036854775806)
Right: int(-9223372036854775808)
Assert failed:
LONG_MIN+1 === pow(LONG_MIN+1,1)
Left: int(-9223372036854775807)
Right: int(-9223372036854775808)
Assert failed:
LONG_MAX === pow(LONG_MAX,1)
Left: int(9223372036854775807)
Right: int(-9223372036854775808)
---- FAILED
================================================================================
001- 1,1,0,0
001+ 1,1,1,1
003- OK
003+
004+ Assert failed:
005+ TRUE === is_infinite(pow(0,-2))
006+ Left: bool(true)
007+ Right: bool(false)
008+
009+ Assert failed:
010+ TRUE === is_infinite(pow(0,-1))
011+ Left: bool(true)
012+ Right: bool(false)
013+
014+ Assert failed:
015+ TRUE === is_infinite(pow(0,-2.0))
016+ Left: bool(true)
017+ Right: bool(false)
018+
019+ Assert failed:
020+ TRUE === is_infinite(pow(0,-1.0))
021+ Left: bool(true)
022+ Right: bool(false)
023+
024+ Assert failed:
025+ TRUE === is_infinite(pow(0.0,-2.0))
026+ Left: bool(true)
027+ Right: bool(false)
028+
029+ Assert failed:
030+ TRUE === is_infinite(pow(0.0,-1.0))
031+ Left: bool(true)
032+ Right: bool(false)
033+
034+ Assert failed:
035+ TRUE === is_infinite(pow( 0.0,-2))
036+ Left: bool(true)
037+ Right: bool(false)
038+
039+ Assert failed:
040+ TRUE === is_infinite(pow( 0.0,-1))
041+ Left: bool(true)
042+ Right: bool(false)
043+
044+ Assert failed:
045+ LONG_MAX-1 === pow(LONG_MAX-1,1)
046+ Left: int(9223372036854775806)
047+ Right: int(-9223372036854775808)
048+
049+ Assert failed:
050+ LONG_MIN+1 === pow(LONG_MIN+1,1)
051+ Left: int(-9223372036854775807)
052+ Right: int(-9223372036854775808)
053+
054+ Assert failed:
055+ LONG_MAX === pow(LONG_MAX,1)
056+ Left: int(9223372036854775807)
057+ Right: int(-9223372036854775808)
================================================================================
================================================================================
/Team/local/src/php-4.3.5RC3/ext/standard/tests/math/round.phpt
================================================================================
---- EXPECTED OUTPUT
1,1,0,0
OK
---- ACTUAL OUTPUT
1,1,1,1
Assert failed:
LONG_MIN-1 ~== round(LONG_MIN - 0.6)
Left: int(9223372036854775807)
Right: float(-9.22337203685E+18)
Assert failed:
LONG_MIN-1 ~== floor(LONG_MIN - 0.5)
Left: int(9223372036854775807)
Right: float(-9.22337203685E+18)
Assert failed:
LONG_MAX+1 ~== ceil(LONG_MAX + 0.5)
Left: int(-9223372036854775808)
Right: float(9.22337203685E+18)
Assert failed:
LONG_MAX+1 ~== round(LONG_MAX + 0.6)
Left: int(-9223372036854775808)
Right: float(9.22337203685E+18)
---- FAILED
================================================================================
001- 1,1,0,0
001+ 1,1,1,1
002- OK
002+
003+ Assert failed:
004+ LONG_MIN-1 ~== round(LONG_MIN - 0.6)
005+ Left: int(9223372036854775807)
006+ Right: float(-9.22337203685E+18)
007+
008+ Assert failed:
009+ LONG_MIN-1 ~== floor(LONG_MIN - 0.5)
010+ Left: int(9223372036854775807)
011+ Right: float(-9.22337203685E+18)
012+
013+ Assert failed:
014+ LONG_MAX+1 ~== ceil(LONG_MAX + 0.5)
015+ Left: int(-9223372036854775808)
016+ Right: float(9.22337203685E+18)
017+
018+ Assert failed:
019+ LONG_MAX+1 ~== round(LONG_MAX + 0.6)
020+ Left: int(-9223372036854775808)
021+ Right: float(9.22337203685E+18)
================================================================================
================================================================================
/Team/local/src/php-4.3.5RC3/ext/standard/tests/time/001.phpt (warn: system dependent)
================================================================================
---- EXPECTED OUTPUT
Passed: 100000
Failed: 0
---- ACTUAL OUTPUT
Passed: 4035
Failed: 95965
000002: 1077031595 0.71465200 < 1077031595 0.71465200
000003: 1077031595 0.71465200 < 1077031595 0.71465200
000004: 1077031595 0.71465200 < 1077031595 0.71465200
000006: 1077031595 0.71563000 < 1077031595 0.71563000
000007: 1077031595 0.71563000 < 1077031595 0.71563000
000008: 1077031595 0.71563000 < 1077031595 0.71563000
000009: 1077031595 0.71563000 < 1077031595 0.71563000
000010: 1077031595 0.71563000 < 1077031595 0.71563000
000011: 1077031595 0.71563000 < 1077031595 0.71563000
000012: 1077031595 0.71563000 < 1077031595 0.71563000
000013: 1077031595 0.71563000 < 1077031595 0.71563000
---- FAILED
================================================================================
001- Passed: 100000
001+ Passed: 4035
002- Failed: 0
002+ Failed: 95965
003+ 000002: 1077031595 0.71465200 < 1077031595 0.71465200
004+ 000003: 1077031595 0.71465200 < 1077031595 0.71465200
005+ 000004: 1077031595 0.71465200 < 1077031595 0.71465200
006+ 000006: 1077031595 0.71563000 < 1077031595 0.71563000
007+ 000007: 1077031595 0.71563000 < 1077031595 0.71563000
008+ 000008: 1077031595 0.71563000 < 1077031595 0.71563000
009+ 000009: 1077031595 0.71563000 < 1077031595 0.71563000
010+ 000010: 1077031595 0.71563000 < 1077031595 0.71563000
011+ 000011: 1077031595 0.71563000 < 1077031595 0.71563000
012+ 000012: 1077031595 0.71563000 < 1077031595 0.71563000
013+ 000013: 1077031595 0.71563000 < 1077031595 0.71563000
================================================================================
================================================================================
/Team/local/src/php-4.3.5RC3/ext/standard/tests/time/002.phpt
================================================================================
---- EXPECTED OUTPUT
1999-10-13 00:00:00
1999-10-13 00:00:00
2000-01-19 00:00:00
2000-01-19 00:00:00
2001-12-21 00:00:00
2001-12-21 00:00:00
2001-12-21 12:16:00
2001-12-21 12:16:00
1969-12-31 23:59:59
2001-10-22 21:19:58
2001-10-22 23:19:58
2001-10-22 23:32:58
2001-10-22 19:19:58
2001-10-22 19:06:58
1999-10-13 00:00:00
1999-10-13 00:00:00
2000-01-19 00:00:00
2000-01-19 00:00:00
2001-12-21 00:00:00
2001-12-21 00:00:00
2001-12-21 12:16:00
2001-12-21 12:16:00
1969-12-31 18:59:59
2001-10-22 21:19:58
2001-10-22 19:19:58
2001-10-22 19:32:58
2001-10-22 15:19:58
2001-10-22 15:06:58
---- ACTUAL OUTPUT
1999-10-13 00:00:00
1999-10-13 00:00:00
2000-01-19 00:00:00
2000-01-19 00:00:00
2001-12-21 00:00:00
2001-12-21 00:00:00
2001-12-21 12:16:00
2001-12-21 12:16:00
1970-01-01 00:59:59
2001-10-22 21:19:58
2001-10-23 01:19:58
2001-10-23 01:32:58
2001-10-22 21:19:58
2001-10-22 21:06:58
1999-10-13 00:00:00
1999-10-13 00:00:00
2000-01-19 00:00:00
2000-01-19 00:00:00
2001-12-21 00:00:00
2001-12-21 00:00:00
2001-12-21 12:16:00
2001-12-21 12:16:00
1970-01-01 00:59:59
2001-10-22 21:19:58
2001-10-23 01:19:58
2001-10-23 01:32:58
2001-10-22 21:19:58
2001-10-22 21:06:58
---- FAILED
================================================================================
009- 1969-12-31 23:59:59
009+ 1970-01-01 00:59:59
011- 2001-10-22 23:19:58
011+ 2001-10-23 01:19:58
012- 2001-10-22 23:32:58
012+ 2001-10-23 01:32:58
013- 2001-10-22 19:19:58
013+ 2001-10-22 21:19:58
014- 2001-10-22 19:06:58
014+ 2001-10-22 21:06:58
023- 1969-12-31 18:59:59
023+ 1970-01-01 00:59:59
025- 2001-10-22 19:19:58
025+ 2001-10-23 01:19:58
026- 2001-10-22 19:32:58
026+ 2001-10-23 01:32:58
027- 2001-10-22 15:19:58
027+ 2001-10-22 21:19:58
028- 2001-10-22 15:06:58
028+ 2001-10-22 21:06:58
================================================================================
================================================================================
/Team/local/src/php-4.3.5RC3/ext/standard/tests/time/bug13142.phpt
================================================================================
---- EXPECTED OUTPUT
Tue, 4 Sep 2001 16:39:45 -0400
Tue, 4 Sep 2001 16:39:45 -0400
---- ACTUAL OUTPUT
Tue, 4 Sep 2001 16:39:45 +0200
Tue, 4 Sep 2001 16:39:45 +0200
---- FAILED
================================================================================
001- Tue, 4 Sep 2001 16:39:45 -0400
001+ Tue, 4 Sep 2001 16:39:45 +0200
002- Tue, 4 Sep 2001 16:39:45 -0400
002+ Tue, 4 Sep 2001 16:39:45 +0200
================================================================================
================================================================================
/Team/local/src/php-4.3.5RC3/ext/standard/tests/time/mktime.phpt
================================================================================
---- EXPECTED OUTPUT
int(1009843200)
int(1009843200)
int(1009843200)
int(1009843200)
int(1025481600)
int(1025481600)
int(1025481600)
int(1025481600)
int(1009839600)
int(1009839600)
int(1009839600)
int(1009836000)
int(1025474400)
int(1025474400)
int(1025478000)
int(1025474400)
---- ACTUAL OUTPUT
int(1009839600)
int(1009839600)
int(1009839600)
int(1009836000)
int(1025474400)
int(1025474400)
int(1025478000)
int(1025474400)
int(1009839600)
int(1009839600)
int(1009839600)
int(1009836000)
int(1025474400)
int(1025474400)
int(1025478000)
int(1025474400)
---- FAILED
================================================================================
001- int(1009843200)
001+ int(1009839600)
002- int(1009843200)
002+ int(1009839600)
003- int(1009843200)
003+ int(1009839600)
004- int(1009843200)
004+ int(1009836000)
005- int(1025481600)
005+ int(1025474400)
006- int(1025481600)
006+ int(1025474400)
007- int(1025481600)
007+ int(1025478000)
008- int(1025481600)
008+ int(1025474400)
================================================================================
================================================================================
/Team/local/src/php-4.3.5RC3/ext/wddx/tests/001.phpt
================================================================================
---- EXPECTED OUTPUT
array(11) {
["aNull"]=>
NULL
["aString"]=>
string(8) "a string"
["aNumber"]=>
float(-12.456)
["aDateTime"]=>
int(897600732)
["aDateTime2"]=>
int(329607132)
["aDateTime3"]=>
string(19) "2040-06-12T04:32:12"
["aBoolean"]=>
bool(true)
["anArray"]=>
array(2) {
[0]=>
int(10)
[1]=>
string(14) "second element"
}
["aBinary"]=>
string(11) "binary data"
["anObject"]=>
array(2) {
["s"]=>
string(8) "a string"
["n"]=>
float(-12.456)
}
["aRecordset"]=>
array(2) {
["NAME"]=>
array(2) {
[0]=>
string(8) "John Doe"
[1]=>
string(8) "Jane Doe"
}
["AGE"]=>
array(2) {
[0]=>
int(34)
[1]=>
int(31)
}
}
}
---- ACTUAL OUTPUT
array(11) {
["aNull"]=>
NULL
["aString"]=>
string(8) "a string"
["aNumber"]=>
float(-12.456)
["aDateTime"]=>
int(897651132)
["aDateTime2"]=>
int(329657532)
["aDateTime3"]=>
string(19) "2040-06-12T04:32:12"
["aBoolean"]=>
bool(true)
["anArray"]=>
array(2) {
[0]=>
int(10)
[1]=>
string(14) "second element"
}
["aBinary"]=>
string(11) "binary data"
["anObject"]=>
array(2) {
["s"]=>
string(8) "a string"
["n"]=>
float(-12.456)
}
["aRecordset"]=>
array(2) {
["NAME"]=>
array(2) {
[0]=>
string(8) "John Doe"
[1]=>
string(8) "Jane Doe"
}
["AGE"]=>
array(2) {
[0]=>
int(34)
[1]=>
int(31)
}
}
}
---- FAILED
================================================================================
009- int(897600732)
009+ int(897651132)
011- int(329607132)
011+ int(329657532)
================================================================================
================================================================================
BUILD ENVIRONMENT
================================================================================
OS:
OSF1 - OSF1 bncqsr13.bn.dcn.detemobil.de V4.0 1530 alpha
Automake:
Autoconf:
Libtool:
ltmain.sh (GNU libtool) 1.4.3 (1.922.2.110 2002/10/23 01:39:54)
Compiler:
Reading specs from /usr/local/lib/gcc-lib/alphaev6-dec-osf4.0f/2.95.2/specs
gcc version 2.95.2 19991024 (release)
Bison:
bison (GNU Bison) 1.30
Copyright 1984, 1986, 1989, 1992, 2000, 2001 Free Software Foundation, Inc.
This is free software; see the source for copying conditions. There is NO
warranty; not even for MERCHANTABILITY or FITNESS FOR A PARTICULAR PURPOSE.
Libraries:
Main => /Team/local/src/php-4.3.5RC3/sapi/cli/php
libintl.so.2 => /Team/local/lib/libintl.so.2
libiconv.so.2 => /Team/local/lib/libiconv.so.2
libc.so => /usr/shlib/libc.so
libt1.so => /Team/local/lib/libt1.so
libfreetype.so.6 => /Team/local/lib/libfreetype.so.6
libpng.so.3.1.2.5 => /Team/local/lib/libpng.so.3.1.2.5
libz.so.1.2.1 => /Team/local/lib/libz.so.1.2.1
libjpeg.so => /Team/local/lib/libjpeg.so
libm.so => /usr/shlib/libm.so
libexc.so => /usr/shlib/libexc.so
librt.so => /usr/shlib/librt.so
libaio_raw.so => /usr/shlib/libaio_raw.so
libclntsh.so.8.0 => /Team/local/lib/libclntsh.so.8.0
libocijdbc8.so => /Team/local/lib/libocijdbc8.so
libjava.so => /usr/shlib/libjava.so
libwtc8.so => /Team/local/lib/libwtc8.so
libpthread.so => /usr/shlib/libpthread.so
libmach.so => /usr/shlib/libmach.so
================================================================================
PHPINFO
================================================================================
phpinfo()
PHP Version => 4.3.5RC3
System => OSF1 bncqsr13.bn.dcn.detemobil.de V4.0 1530 alpha
Build Date => Feb 17 2004 16:19:14
Configure Command => './configure' '--prefix=/Team/local'
'--enable-magic-quotes' '--enable-trans-sid' '--enable-wddx'
'--enable-ftp' '--with-oci8' '--enable-calendar'
'--with-gettext=/Team/local' '--enable-memory-limit' '--with-gd'
'--with-zlib=/Team/local' '--enable-exif' '--enable-gd-native-tt'
'--with-t1lib=/Team/local' '--with-jpeg-dir=/Team/local'
'--with-png-dir=/Team/local' '--with-ttf'
'--with-freetype-dir=/Team/local' '--without-mysql'
Server API => Command Line Interface
Virtual Directory Support => disabled
Configuration File (php.ini) Path => /Team/local/lib/php.ini
PHP API => 20020918
PHP Extension => 20020429
Zend Extension => 20021010
Debug Build => no
Thread Safety => disabled
Registered PHP Streams => php, http, ftp, compress.zlib
This program makes use of the Zend Scripting Language Engine:
Zend Engine v1.3.0, Copyright (c) 1998-2004 Zend Technologies
_______________________________________________________________________
Configuration
PHP Core
Directive => Local Value => Master Value
allow_call_time_pass_reference => On => On
allow_url_fopen => On => On
always_populate_raw_post_data => Off => Off
arg_separator.input => & => &
arg_separator.output => & => &
asp_tags => Off => Off
auto_append_file => no value => no value
auto_prepend_file => no value => no value
browscap => no value => no value
default_charset => no value => no value
default_mimetype => text/html => text/html
define_syslog_variables => Off => Off
disable_classes => no value => no value
disable_functions => no value => no value
display_errors => On => On
display_startup_errors => Off => Off
doc_root => no value => no value
docref_ext => no value => no value
docref_root => no value => no value
enable_dl => On => On
error_append_string => no value => no value
error_log => no value => no value
error_prepend_string => no value => no value
error_reporting => 2039 => 2039
expose_php => On => On
extension_dir => ./ => ./
file_uploads => On => On
gpc_order => GPC => GPC
highlight.bg => #FFFFFF => #FFFFFF
highlight.comment => #FF9900 => #FF9900
highlight.default => #0000CC => #0000CC
highlight.html => #000000 => #000000
highlight.keyword => #006600 => #006600
highlight.string => #CC0000 => #CC0000
html_errors => Off => On
ignore_repeated_errors => Off => Off
ignore_repeated_source => Off => Off
ignore_user_abort => Off => Off
implicit_flush => On => Off
include_path => .:/Team/local/lib/php => .:/Team/local/lib/php
log_errors => Off => Off
log_errors_max_len => 1024 => 1024
magic_quotes_gpc => On => On
magic_quotes_runtime => Off => Off
magic_quotes_sybase => Off => Off
max_execution_time => 0 => 30
max_input_time => -1 => -1
memory_limit => 8M => 8M
open_basedir => no value => no value
output_buffering => 0 => no value
output_handler => no value => no value
post_max_size => 8M => 8M
precision => 12 => 12
register_argc_argv => On => On
register_globals => On => On
report_memleaks => On => On
safe_mode => Off => Off
safe_mode_exec_dir => no value => no value
safe_mode_gid => Off => Off
safe_mode_include_dir => no value => no value
sendmail_from => me@localhost.com => me@localhost.com
sendmail_path => /usr/sbin/sendmail -t -i => /usr/sbin/sendmail -t -i
serialize_precision => 100 => 100
short_open_tag => On => On
SMTP => localhost => localhost
smtp_port => 25 => 25
sql.safe_mode => Off => Off
track_errors => Off => Off
unserialize_callback_func => no value => no value
upload_max_filesize => 20M => 20M
upload_tmp_dir => no value => no value
user_dir => no value => no value
variables_order => EGPCS => EGPCS
xmlrpc_error_number => 0 => 0
xmlrpc_errors => Off => Off
y2k_compliance => Off => Off
calendar
Calendar support => enabled
ctype
ctype functions => enabled
exif
EXIF Support => enabled
EXIF Version => 1.4 $Id: exif.c,v 1.118.2.27 2003/12/17 09:08:37 helly Exp $
Supported EXIF Version => 0220
Supported filetypes => JPEG,TIFF
ftp
FTP support => enabled
gd
GD Support => enabled
GD Version => bundled (2.0.17 compatible)
FreeType Support => enabled
FreeType Linkage => with freetype
T1Lib Support => enabled
GIF Read Support => enabled
JPG Support => enabled
PNG Support => enabled
WBMP Support => enabled
XBM Support => enabled
gettext
GetText Support => enabled
oci8
OCI8 Support => enabled
Revision => $Revision: 1.183.2.12 $
Oracle Version => 8.1
Compile-time ORACLE_HOME => /appl/oracle/product/8.1.6
Libraries Used =>
overload
User-Space Object Overloading Support => enabled
pcre
PCRE (Perl Compatible Regular Expressions) Support => enabled
PCRE Library Version => 4.5 01-December-2003
posix
Revision => $Revision: 1.51.2.2 $
session
Session Support => enabled
Registered save handlers => files user
Directive => Local Value => Master Value
session.auto_start => Off => Off
session.bug_compat_42 => On => On
session.bug_compat_warn => On => On
session.cache_expire => 180 => 180
session.cache_limiter => nocache => nocache
session.cookie_domain => no value => no value
session.cookie_lifetime => 0 => 0
session.cookie_path => / => /
session.cookie_secure => Off => Off
session.entropy_file => no value => no value
session.entropy_length => 0 => 0
session.gc_divisor => 100 => 100
session.gc_maxlifetime => 1440 => 1440
session.gc_probability => 1 => 1
session.name => PHPSESSID => PHPSESSID
session.referer_check => no value => no value
session.save_handler => files => files
session.save_path => /tmp => /tmp
session.serialize_handler => php => php
session.use_cookies => On => On
session.use_only_cookies => Off => Off
session.use_trans_sid => On => On
standard
Regex Library => Bundled library enabled
Dynamic Library Support => enabled
Path to sendmail => /usr/sbin/sendmail -t -i
Directive => Local Value => Master Value
assert.active => 1 => 1
assert.bail => 0 => 0
assert.callback => no value => no value
assert.quiet_eval => 0 => 0
assert.warning => 1 => 1
auto_detect_line_endings => 0 => 0
default_socket_timeout => 60 => 60
safe_mode_allowed_env_vars => PHP_ => PHP_
safe_mode_protected_env_vars => LD_LIBRARY_PATH => LD_LIBRARY_PATH
url_rewriter.tags => a=href,area=href,frame=src,input=src,form=fakeentry =>
a=href,area=href,frame=src,input=src,form=fakeentry
user_agent => no value => no value
tokenizer
Tokenizer Support => enabled
wddx
WDDX Support => enabled
WDDX Session Serializer => enabled
xml
XML Support => active
XML Namespace Support => active
EXPAT Version => 1.95.6
zlib
ZLib Support => enabled
Compiled Version => 1.2.1
Linked Version => 1.2.1
Directive => Local Value => Master Value
zlib.output_compression => Off => Off
zlib.output_compression_level => -1 => -1
zlib.output_handler => no value => no value
Additional Modules
Module Name
Environment
Variable => Value
CC => gcc
CFLAGS => -Wall -prefer-non-pic -static
CONTENT_LENGTH =>
CONTENT_TYPE =>
LD_LIBRARY_PATH =>
/Team/local/lib:/usr/lib:/usr/openwin/lib:/usr/dt/lib:/usr/lib:/appl/oracle/product/8.1.6/lib:/appl/oracle/product/8.1.6/network/lib
MAKEFLAGS =>
MAKELEVEL => 1
MFLAGS =>
ORACLE_HOME => /appl/oracle/product/8.1.6
PATH =>
/usr/users/mauchm/bin:/Team/local/bin:/usr/bin/posix:/usr/local/bin:/usr/bin:/usr/bin/X11:/usr/dt/bin:/Team/scripts:/Team/bin:/Team/sss/scripts:/Team/sss/bin:/Team/scripts/nko:/Team/scripts/nko/cm4nuss:/sbin:/usr/sbin:/usr/local/sbin:.:/usr/local/bin:/appl/oracle/product/8.1.6/bin:.
PATH_TRANSLATED =>
QUERY_STRING =>
REDIRECT_STATUS =>
REQUEST_METHOD =>
SCRIPT_FILENAME =>
SHELL => /bin/ksh
TEST_PHP_EXECUTABLE => /Team/local/src/php-4.3.5RC3/sapi/cli/php
TEST_PHP_SRCDIR => /Team/local/src/php-4.3.5RC3
PHP Variables
Variable => Value
PHP_SELF =>
_SERVER["CC"] => gcc
_SERVER["CFLAGS"] => -Wall -prefer-non-pic -static
_SERVER["CONTENT_LENGTH"] =>
_SERVER["CONTENT_TYPE"] =>
_SERVER["LD_LIBRARY_PATH"] =>
/Team/local/lib:/usr/lib:/usr/openwin/lib:/usr/dt/lib:/usr/lib:/appl/oracle/product/8.1.6/lib:/appl/oracle/product/8.1.6/network/lib
_SERVER["MAKEFLAGS"] =>
_SERVER["MAKELEVEL"] => 1
_SERVER["MFLAGS"] =>
_SERVER["ORACLE_HOME"] => /appl/oracle/product/8.1.6
_SERVER["PATH"] =>
/usr/users/mauchm/bin:/Team/local/bin:/usr/bin/posix:/usr/local/bin:/usr/bin:/usr/bin/X11:/usr/dt/bin:/Team/scripts:/Team/bin:/Team/sss/scripts:/Team/sss/bin:/Team/scripts/nko:/Team/scripts/nko/cm4nuss:/sbin:/usr/sbin:/usr/local/sbin:.:/usr/local/bin:/appl/oracle/product/8.1.6/bin:.
_SERVER["PATH_TRANSLATED"] =>
_SERVER["QUERY_STRING"] =>
_SERVER["REDIRECT_STATUS"] =>
_SERVER["REQUEST_METHOD"] =>
_SERVER["SCRIPT_FILENAME"] =>
_SERVER["SHELL"] => /bin/ksh
_SERVER["TEST_PHP_EXECUTABLE"] => /Team/local/src/php-4.3.5RC3/sapi/cli/php
_SERVER["TEST_PHP_SRCDIR"] => /Team/local/src/php-4.3.5RC3
_SERVER["PHP_SELF"] =>
_SERVER["SCRIPT_NAME"] =>
_SERVER["DOCUMENT_ROOT"] =>
_SERVER["argv"] => Array
(
)
_SERVER["argc"] => 0
_ENV["CC"] => gcc
_ENV["CFLAGS"] => -Wall -prefer-non-pic -static
_ENV["CONTENT_LENGTH"] =>
_ENV["CONTENT_TYPE"] =>
_ENV["LD_LIBRARY_PATH"] =>
/Team/local/lib:/usr/lib:/usr/openwin/lib:/usr/dt/lib:/usr/lib:/appl/oracle/product/8.1.6/lib:/appl/oracle/product/8.1.6/network/lib
_ENV["MAKEFLAGS"] =>
_ENV["MAKELEVEL"] => 1
_ENV["MFLAGS"] =>
_ENV["ORACLE_HOME"] => /appl/oracle/product/8.1.6
_ENV["PATH"] =>
/usr/users/mauchm/bin:/Team/local/bin:/usr/bin/posix:/usr/local/bin:/usr/bin:/usr/bin/X11:/usr/dt/bin:/Team/scripts:/Team/bin:/Team/sss/scripts:/Team/sss/bin:/Team/scripts/nko:/Team/scripts/nko/cm4nuss:/sbin:/usr/sbin:/usr/local/sbin:.:/usr/local/bin:/appl/oracle/product/8.1.6/bin:.
_ENV["PATH_TRANSLATED"] =>
_ENV["QUERY_STRING"] =>
_ENV["REDIRECT_STATUS"] =>
_ENV["REQUEST_METHOD"] =>
_ENV["SCRIPT_FILENAME"] =>
_ENV["SHELL"] => /bin/ksh
_ENV["TEST_PHP_EXECUTABLE"] => /Team/local/src/php-4.3.5RC3/sapi/cli/php
_ENV["TEST_PHP_SRCDIR"] => /Team/local/src/php-4.3.5RC3
PHP License
This program is free software; you can redistribute it and/or modify
it under the terms of the PHP License as published by the PHP Group
and included in the distribution in the file: LICENSE
This program is distributed in the hope that it will be useful,
but WITHOUT ANY WARRANTY; without even the implied warranty of
MERCHANTABILITY or FITNESS FOR A PARTICULAR PURPOSE.
If you did not receive a copy of the PHP license, or have any
questions about PHP licensing, please contact license@php.net.