PHP 4.3.5 RC3 Test results (Solaris, ZTS)

From: Date: Tue, 17 Feb 2004 19:08:49 +0000
Subject: PHP 4.3.5 RC3 Test results (Solaris, ZTS)
Groups: php.qa 
Request: Send a blank email to php-qa+get-15976@lists.php.net to get a copy of this message
----- Uwe Schindler thetaphi@php.net - http://www.php.net NSAPI SAPI developer Erlangen, Germany

===================================================================== FAILED TEST SUMMARY --------------------------------------------------------------------- Bug #25547 (error_handler and array index with function call) [tests/lang/bug25547.phpt] Bug #25665 (var_dump () hangs on Nan and INF) [ext/standard/tests/math/bug25665.phpt] General semaphore and shared memory test [ext/sysvsem/tests/sysv.phpt] ===================================================================== ===================================================================== TEST RESULT SUMMARY --------------------------------------------------------------------- Exts skipped : 72 Exts tested : 15 --------------------------------------------------------------------- Number of tests : 578 Tests skipped : 200 (34.6%) Tests warned : 0 ( 0.0%) Tests failed : 3 ( 0.5%) Tests passed : 375 (64.9%) --------------------------------------------------------------------- Time taken : 90 seconds ===================================================================== ================================================================================ /pangaea/install/php-4.3.5RC3/tests/lang/bug25547.phpt ================================================================================ ---- EXPECTED OUTPUT handler(Undefined index: foo) Array ( [foo] => 1 ) Done ---- ACTUAL OUTPUT handler(Undefined index: foo) Array ( [(o] => 1 ) Done ---- FAILED ================================================================================ 004- [foo] => 1 004+ [(o] => 1 ================================================================================ ================================================================================ /pangaea/install/php-4.3.5RC3/ext/standard/tests/math/bug25665.phpt ================================================================================ ---- EXPECTED OUTPUT float(NAN) float(-INF) ---- ACTUAL OUTPUT float(0) float(-INF) ---- FAILED ================================================================================ 001- float(NAN) 001+ float(0) ================================================================================ ================================================================================ /pangaea/install/php-4.3.5RC3/ext/sysvsem/tests/sysv.phpt ================================================================================ ---- EXPECTED OUTPUT Start. Got semaphore Resource id #%i. Success aquire semaphore Resource id #%i. Success to attach shared memory : %i. Write var1 to shared memory. Write var2 to shared memory. Read var1=Variable 1. Read var2=Variable 2. Semaphore Resource id #%i released. Shared memory successfully removed from SysV. semaphore removed successfully from SysV. End. ---- ACTUAL OUTPUT Start. Warning: semget() failed for key 0x1: Invalid argument in /pangaea/install/php-4.3.5RC3/ext/sysvsem/tests/sysv.php on line 8 Fail to get semaphore ---- FAILED ================================================================================ 002- Got semaphore Resource id #%i. 002+ 003- Success aquire semaphore Resource id #%i. 003+ Warning: semget() failed for key 0x1: Invalid argument in /pangaea/install/php-4.3.5RC3/ext/sysvsem/tests/sysv.php on line 8 004- Success to attach shared memory : %i. 004+ Fail to get semaphore 005- Write var1 to shared memory. 006- Write var2 to shared memory. 007- Read var1=Variable 1. 008- Read var2=Variable 2. 009- Semaphore Resource id #%i released. 010- Shared memory successfully removed from SysV. 011- semaphore removed successfully from SysV. 012- End. ================================================================================ ================================================================================ BUILD ENVIRONMENT ================================================================================ OS: SunOS - SunOS pans1 5.9 Generic_112233-11 sun4u Automake: Autoconf: Libtool: ltmain.sh (GNU libtool) 1.4.3 (1.922.2.110 2002/10/23 01:39:54) Compiler: N/A Bison: Libraries: libct.so.2 => /pangaea/freetds/lib/libct.so.2 libz.so => /usr/local/lib/libz.so libssl.so.0.9.7 => /usr/local/ssl/lib/libssl.so.0.9.7 libcrypto.so.0.9.7 => /usr/local/ssl/lib/libcrypto.so.0.9.7 libresolv.so.2 => /usr/lib/libresolv.so.2 libm.so.1 => /usr/lib/libm.so.1 libdl.so.1 => /usr/lib/libdl.so.1 libnsl.so.1 => /usr/lib/libnsl.so.1 libsocket.so.1 => /usr/lib/libsocket.so.1 libthread.so.1 => /usr/lib/libthread.so.1 libc.so.1 => /usr/lib/libc.so.1 libgcc_s.so.1 => /usr/local/lib/libgcc_s.so.1 libmp.so.2 => /usr/lib/libmp.so.2 librt.so.1 => /usr/lib/librt.so.1 libaio.so.1 => /usr/lib/libaio.so.1 libmd5.so.1 => /usr/lib/libmd5.so.1 /usr/platform/SUNW,Sun-Fire-V240/lib/libc_psr.so.1 /usr/platform/SUNW,Sun-Fire-V240/lib/libmd5_psr.so.1 ================================================================================ PHPINFO ================================================================================ phpinfo() PHP Version => 4.3.5RC3 System => SunOS pans1 5.9 Generic_112233-11 sun4u Build Date => Feb 17 2004 10:19:59 Configure Command => './configure' '--prefix=/pangaea/PHP4' '--enable-cli' '--with-nsapi=/pangaea/webserver61' '--with-sybase-ct=/pangaea/freetds' '--without-mysql' '--enable-sysvshm' '--enable-sysvsem' '--enable-ftp' '--enable-versioning' '--enable-session' '--enable-trans-sid' '--with-zlib' '--enable-mbstring=all' '--with-openssl' Server API => Command Line Interface Virtual Directory Support => enabled Configuration File (php.ini) Path => /pangaea/PHP4/lib PHP API => 20020918 PHP Extension => 20020429 Zend Extension => 20021010 Debug Build => no Thread Safety => enabled Registered PHP Streams => php, http, ftp, https, ftps, compress.zlib This program makes use of the Zend Scripting Language Engine: Zend Engine v1.3.0, Copyright (c) 1998-2004 Zend Technologies _______________________________________________________________________ Configuration PHP Core Directive => Local Value => Master Value allow_call_time_pass_reference => On => On allow_url_fopen => On => On always_populate_raw_post_data => Off => Off arg_separator.input => & => & arg_separator.output => & => & asp_tags => Off => Off auto_append_file => no value => no value auto_prepend_file => no value => no value browscap => no value => no value default_charset => no value => no value default_mimetype => text/html => text/html define_syslog_variables => Off => Off disable_classes => no value => no value disable_functions => no value => no value display_errors => On => On display_startup_errors => Off => Off doc_root => no value => no value docref_ext => no value => no value docref_root => no value => no value enable_dl => On => On error_append_string => no value => no value error_log => no value => no value error_prepend_string => no value => no value error_reporting => no value => no value expose_php => On => On extension_dir => /pangaea/PHP4/lib/php/extensions/no-debug-zts-20020429 => /pangaea/PHP4/lib/php/extensions/no-debug-zts-20020429 file_uploads => On => On gpc_order => GPC => GPC highlight.bg => #FFFFFF => #FFFFFF highlight.comment => #FF8000 => #FF8000 highlight.default => #0000BB => #0000BB highlight.html => #000000 => #000000 highlight.keyword => #007700 => #007700 highlight.string => #DD0000 => #DD0000 html_errors => Off => On ignore_repeated_errors => Off => Off ignore_repeated_source => Off => Off ignore_user_abort => Off => Off implicit_flush => On => Off include_path => .:/pangaea/PHP4/lib/php => .:/pangaea/PHP4/lib/php log_errors => Off => Off log_errors_max_len => 1024 => 1024 magic_quotes_gpc => On => On magic_quotes_runtime => Off => Off magic_quotes_sybase => Off => Off max_execution_time => 0 => 30 max_input_time => -1 => -1 open_basedir => no value => no value output_buffering => 0 => 0 output_handler => no value => no value post_max_size => 8M => 8M precision => 14 => 14 register_argc_argv => On => On register_globals => Off => Off report_memleaks => On => On safe_mode => Off => Off safe_mode_exec_dir => /usr/local/php/bin => /usr/local/php/bin safe_mode_gid => Off => Off safe_mode_include_dir => no value => no value sendmail_from => no value => no value sendmail_path => /usr/lib/sendmail -t -i => /usr/lib/sendmail -t -i serialize_precision => 100 => 100 short_open_tag => On => On SMTP => localhost => localhost smtp_port => 25 => 25 sql.safe_mode => Off => Off track_errors => Off => Off unserialize_callback_func => no value => no value upload_max_filesize => 2M => 2M upload_tmp_dir => no value => no value user_dir => no value => no value variables_order => no value => no value xmlrpc_error_number => 0 => 0 xmlrpc_errors => Off => Off y2k_compliance => On => On ctype ctype functions => enabled ftp FTP support => enabled mbstring Multibyte Support => enabled Japanese support => enabled Simplified chinese support => enabled Traditional chinese support => enabled Korean support => enabled Russian support => enabled Multibyte (japanese) regex support => enabled mbstring extension makes use of "streamable kanji code filter and converter", which is distributed under the GNU Lesser General Public License version 2.1. Directive => Local Value => Master Value mbstring.detect_order => no value => no value mbstring.encoding_translation => Off => Off mbstring.func_overload => 0 => 0 mbstring.http_input => pass => pass mbstring.http_output => pass => pass mbstring.internal_encoding => ISO-8859-1 => no value mbstring.language => neutral => neutral mbstring.substitute_character => no value => no value openssl OpenSSL support => enabled OpenSSL Version => OpenSSL 0.9.7b 10 Apr 2003 overload User-Space Object Overloading Support => enabled pcre PCRE (Perl Compatible Regular Expressions) Support => enabled PCRE Library Version => 4.5 01-December-2003 posix Revision => $Revision: 1.51.2.2 $ session Session Support => enabled Registered save handlers => files user Directive => Local Value => Master Value session.auto_start => Off => Off session.bug_compat_42 => On => On session.bug_compat_warn => On => On session.cache_expire => 180 => 180 session.cache_limiter => nocache => nocache session.cookie_domain => no value => no value session.cookie_lifetime => 0 => 0 session.cookie_path => / => / session.cookie_secure => Off => Off session.entropy_file => no value => no value session.entropy_length => 0 => 0 session.gc_divisor => 100 => 100 session.gc_maxlifetime => 1440 => 1440 session.gc_probability => 1 => 1 session.name => PHPSESSID => PHPSESSID session.referer_check => no value => no value session.save_handler => files => files session.save_path => /tmp => /tmp session.serialize_handler => php => php session.use_cookies => On => On session.use_only_cookies => Off => Off session.use_trans_sid => Off => Off standard Regex Library => Bundled library enabled Dynamic Library Support => enabled Path to sendmail => /usr/lib/sendmail -t -i Directive => Local Value => Master Value assert.active => 1 => 1 assert.bail => 0 => 0 assert.callback => no value => no value assert.quiet_eval => 0 => 0 assert.warning => 1 => 1 auto_detect_line_endings => 0 => 0 default_socket_timeout => 60 => 60 safe_mode_allowed_env_vars => PHP_ => PHP_ safe_mode_protected_env_vars => LD_LIBRARY_PATH => LD_LIBRARY_PATH url_rewriter.tags => a=href,area=href,frame=src,form=,fieldset= => a=href,area=href,frame=src,form=,fieldset= user_agent => no value => no value sybase_ct Sybase_CT Support => enabled Active Persistent Links => 0 Active Links => 0 Min server severity => 10 Min client severity => 10 Application Name => PHP 4.0 Deadlock retry count => -1 Directive => Local Value => Master Value sybct.allow_persistent => On => On sybct.deadlock_retry_count => Unlimited => Unlimited sybct.hostname => no value => no value sybct.login_timeout => -1 => -1 sybct.max_links => Unlimited => Unlimited sybct.max_persistent => Unlimited => Unlimited sybct.min_client_severity => 10 => 10 sybct.min_server_severity => 10 => 10 tokenizer Tokenizer Support => enabled xml XML Support => active XML Namespace Support => active EXPAT Version => 1.95.6 zlib ZLib Support => enabled Compiled Version => 1.1.4 Linked Version => 1.1.4 Directive => Local Value => Master Value zlib.output_compression => Off => Off zlib.output_compression_level => -1 => -1 zlib.output_handler => no value => no value Additional Modules Module Name sysvsem sysvshm Environment Variable => Value CC => /pangaea/install/php-4.3.5RC3/meta_ccld CONTENT_LENGTH => CONTENT_TYPE => EMACSDIR => /applic/emacs FORTE7DIR => /opt/forte7/SUNWspro HOME => /pangaea HOSTNAME => pans1 HOSTTYPE => sparc INFOPATH => /applic/emacs/info LD_LIBRARY_PATH => /opt/forte7/SUNWspro/lib:/usr/local/lib LOGNAME => pangaeaw MACHTYPE => sparc-sun-solaris2.9 MAKEFLAGS => MAKELEVEL => 1 MANPATH => /usr/local/man:/usr/man:/opt/forte7/SUNWspro/man:/applic/emacs/man OLDPWD => /pangaea/install OSTYPE => solaris2.9 PATH => /usr/ccs/bin:/usr/ccs/lib:/opt/forte7/SUNWspro/bin:/usr/bin:/bin:/usr/sbin:/sbin:/applic/emacs/bin:/usr/local/bin PATH_TRANSLATED => PWD => /pangaea/install/php-4.3.5RC3 QUERY_STRING => REDIRECT_STATUS => REQUEST_METHOD => SCRIPT_FILENAME => SGS_SUPPORT => libmakestate.so.1 SHELL => /bin/csh SHLVL => 1 SSH_TTY => /dev/pts/1 SYBASE => /pangaea/freetds TERM => vt100 TEST_PHP_EXECUTABLE => /pangaea/install/php-4.3.5RC3/sapi/cli/php TEST_PHP_SRCDIR => /pangaea/install/php-4.3.5RC3 TZ => MET USER => pangaeaw VIRTUAL_ROOT => / _ => /usr/ccs/bin/make PHP Variables Variable => Value _SERVER["CC"] => /pangaea/install/php-4.3.5RC3/meta_ccld _SERVER["CONTENT_LENGTH"] => _SERVER["CONTENT_TYPE"] => _SERVER["EMACSDIR"] => /applic/emacs _SERVER["FORTE7DIR"] => /opt/forte7/SUNWspro _SERVER["HOME"] => /pangaea _SERVER["HOSTNAME"] => pans1 _SERVER["HOSTTYPE"] => sparc _SERVER["INFOPATH"] => /applic/emacs/info _SERVER["LD_LIBRARY_PATH"] => /opt/forte7/SUNWspro/lib:/usr/local/lib _SERVER["LOGNAME"] => pangaeaw _SERVER["MACHTYPE"] => sparc-sun-solaris2.9 _SERVER["MAKEFLAGS"] => _SERVER["MAKELEVEL"] => 1 _SERVER["MANPATH"] => /usr/local/man:/usr/man:/opt/forte7/SUNWspro/man:/applic/emacs/man _SERVER["OLDPWD"] => /pangaea/install _SERVER["OSTYPE"] => solaris2.9 _SERVER["PATH"] => /usr/ccs/bin:/usr/ccs/lib:/opt/forte7/SUNWspro/bin:/usr/bin:/bin:/usr/sbin:/sbin:/applic/emacs/bin:/usr/local/bin _SERVER["PATH_TRANSLATED"] => _SERVER["PWD"] => /pangaea/install/php-4.3.5RC3 _SERVER["QUERY_STRING"] => _SERVER["REDIRECT_STATUS"] => _SERVER["REQUEST_METHOD"] => _SERVER["SCRIPT_FILENAME"] => _SERVER["SGS_SUPPORT"] => libmakestate.so.1 _SERVER["SHELL"] => /bin/csh _SERVER["SHLVL"] => 1 _SERVER["SSH_TTY"] => /dev/pts/1 _SERVER["SYBASE"] => /pangaea/freetds _SERVER["TERM"] => vt100 _SERVER["TEST_PHP_EXECUTABLE"] => /pangaea/install/php-4.3.5RC3/sapi/cli/php _SERVER["TEST_PHP_SRCDIR"] => /pangaea/install/php-4.3.5RC3 _SERVER["TZ"] => MET _SERVER["USER"] => pangaeaw _SERVER["VIRTUAL_ROOT"] => / _SERVER["_"] => /usr/ccs/bin/make _SERVER["PHP_SELF"] => _SERVER["SCRIPT_NAME"] => _SERVER["DOCUMENT_ROOT"] => _SERVER["argv"] => Array ( ) _SERVER["argc"] => 0 _ENV["CC"] => /pangaea/install/php-4.3.5RC3/meta_ccld _ENV["CONTENT_LENGTH"] => _ENV["CONTENT_TYPE"] => _ENV["EMACSDIR"] => /applic/emacs _ENV["FORTE7DIR"] => /opt/forte7/SUNWspro _ENV["HOME"] => /pangaea _ENV["HOSTNAME"] => pans1 _ENV["HOSTTYPE"] => sparc _ENV["INFOPATH"] => /applic/emacs/info _ENV["LD_LIBRARY_PATH"] => /opt/forte7/SUNWspro/lib:/usr/local/lib _ENV["LOGNAME"] => pangaeaw _ENV["MACHTYPE"] => sparc-sun-solaris2.9 _ENV["MAKEFLAGS"] => _ENV["MAKELEVEL"] => 1 _ENV["MANPATH"] => /usr/local/man:/usr/man:/opt/forte7/SUNWspro/man:/applic/emacs/man _ENV["OLDPWD"] => /pangaea/install _ENV["OSTYPE"] => solaris2.9 _ENV["PATH"] => /usr/ccs/bin:/usr/ccs/lib:/opt/forte7/SUNWspro/bin:/usr/bin:/bin:/usr/sbin:/sbin:/applic/emacs/bin:/usr/local/bin _ENV["PATH_TRANSLATED"] => _ENV["PWD"] => /pangaea/install/php-4.3.5RC3 _ENV["QUERY_STRING"] => _ENV["REDIRECT_STATUS"] => _ENV["REQUEST_METHOD"] => _ENV["SCRIPT_FILENAME"] => _ENV["SGS_SUPPORT"] => libmakestate.so.1 _ENV["SHELL"] => /bin/csh _ENV["SHLVL"] => 1 _ENV["SSH_TTY"] => /dev/pts/1 _ENV["SYBASE"] => /pangaea/freetds _ENV["TERM"] => vt100 _ENV["TEST_PHP_EXECUTABLE"] => /pangaea/install/php-4.3.5RC3/sapi/cli/php _ENV["TEST_PHP_SRCDIR"] => /pangaea/install/php-4.3.5RC3 _ENV["TZ"] => MET _ENV["USER"] => pangaeaw _ENV["VIRTUAL_ROOT"] => / _ENV["_"] => /usr/ccs/bin/make PHP License This program is free software; you can redistribute it and/or modify it under the terms of the PHP License as published by the PHP Group and included in the distribution in the file: LICENSE This program is distributed in the hope that it will be useful, but WITHOUT ANY WARRANTY; without even the implied warranty of MERCHANTABILITY or FITNESS FOR A PARTICULAR PURPOSE. If you did not receive a copy of the PHP license, or have any questions about PHP licensing, please contact license@php.net.
« previous php.qa (#15976) next »