Test results for 5.0.3 [failed]

From: Date: Fri, 18 Feb 2005 09:43:23 +0000
Subject: Test results for 5.0.3 [failed]
Groups: php.qa 
Request: Send a blank email to php-qa+get-23758@lists.php.net to get a copy of this message
===================================================================== FAILED TEST SUMMARY --------------------------------------------------------------------- Test for buffering in core functions with implicit flush off [tests/func/008.phpt] Convert warnings to exceptions [tests/lang/038.phpt] Bug #22836 (returning references to NULL) [Zend/tests/bug22836.phpt] Bug #28444 (Cannot access undefined property for object with overloaded property access) [Zend/tests/bug28444.phpt] Test 3: Exception Test [ext/dom/tests/dom003.phpt] Test 5: HTML Test [ext/dom/tests/dom005.phpt] Bug #16069 [ext/iconv/tests/bug16069.phpt] iconv stream filter [ext/iconv/tests/iconv_stream_filter.phpt] HTML input/output [ext/mbstring/tests/htmlent.phpt] mb_output_handler() (Shift_JIS) [ext/mbstring/tests/mb_output_handler_shift_jis.phpt] Bug #29992 (foreach by reference corrupts the array) [ext/standard/tests/array/bug29992.phpt] Bug #20382 (strtotime ("Monday", $date) produces wrong result on DST changeover) [ext/standard/tests/time/bug20382.phpt] Bug #26614 (CDATA sections skipped on line count) [ext/xml/tests/bug26614.phpt] ===================================================================== ===================================================================== TEST RESULT SUMMARY --------------------------------------------------------------------- Exts skipped : 69 Exts tested : 14 --------------------------------------------------------------------- Number of tests : 1291 668 Tests skipped : 623 (48.3%) -------- Tests warned : 0 (0.0%) (0.0%) Tests failed : 13 (1.0%) (1.9%) Tests passed : 655 (50.7%) (98.1%) --------------------------------------------------------------------- Time taken : 46 seconds ===================================================================== ===================================================================== FAILED TEST SUMMARY --------------------------------------------------------------------- Test for buffering in core functions with implicit flush off [tests/func/008.phpt] Convert warnings to exceptions [tests/lang/038.phpt] Bug #22836 (returning references to NULL) [Zend/tests/bug22836.phpt] Bug #28444 (Cannot access undefined property for object with overloaded property access) [Zend/tests/bug28444.phpt] Test 3: Exception Test [ext/dom/tests/dom003.phpt] Test 5: HTML Test [ext/dom/tests/dom005.phpt] Bug #16069 [ext/iconv/tests/bug16069.phpt] iconv stream filter [ext/iconv/tests/iconv_stream_filter.phpt] HTML input/output [ext/mbstring/tests/htmlent.phpt] mb_output_handler() (Shift_JIS) [ext/mbstring/tests/mb_output_handler_shift_jis.phpt] Bug #29992 (foreach by reference corrupts the array) [ext/standard/tests/array/bug29992.phpt] Bug #20382 (strtotime ("Monday", $date) produces wrong result on DST changeover) [ext/standard/tests/time/bug20382.phpt] Bug #26614 (CDATA sections skipped on line count) [ext/xml/tests/bug26614.phpt] ===================================================================== ================================================================================ /home/tm/tmp/php-5.0.3/tests/func/008.phpt ================================================================================ ---- EXPECTED OUTPUT 'foo1' 'foo2' ---- ACTUAL OUTPUT ---- FAILED ================================================================================ 001- 'foo1' 003- 'foo2' ================================================================================ ================================================================================ /home/tm/tmp/php-5.0.3/tests/lang/038.phpt ================================================================================ ---- EXPECTED OUTPUT string(15) "Error2Exception" string(5) "fopen" ===DONE=== ---- ACTUAL OUTPUT string(15) "Error2Exception" string(15) "Error2Exception" ===DONE=== ---- FAILED ================================================================================ 002+ string(15) "Error2Exception" 002- string(5) "fopen" ================================================================================ ================================================================================ /home/tm/tmp/php-5.0.3/Zend/tests/bug22836.phpt ================================================================================ ---- EXPECTED OUTPUT string(3) "foo" 'foo' Notice: Undefined variable: a in %s on line %d Strict Standards: Only variable references should be returned by reference in %s on line %d string(3) "foo" 'foo' Notice: Undefined variable: a in %s on line %d Strict Standards: Only variable references should be returned by reference in %s on line %d string(3) "foo" 'foo' Notice: Undefined variable: a in %s on line %d Strict Standards: Only variable references should be returned by reference in %s on line %d string(3) "foo" 'foo' Notice: Undefined variable: a in %s on line %d Strict Standards: Only variable references should be returned by reference in %s on line %d string(3) "foo" 'foo' Notice: Undefined variable: a in %s on line %d Strict Standards: Only variable references should be returned by reference in %s on line %d string(3) "foo" 'foo' Notice: Undefined variable: a in %s on line %d Strict Standards: Only variable references should be returned by reference in %s on line %d string(3) "foo" 'foo' Notice: Undefined variable: a in %s on line %d Strict Standards: Only variable references should be returned by reference in %s on line %d string(3) "foo" 'foo' Notice: Undefined variable: a in %s on line %d Strict Standards: Only variable references should be returned by reference in %s on line %d string(3) "foo" 'foo' Notice: Undefined variable: a in %s on line %d Strict Standards: Only variable references should be returned by reference in %s on line %d ---- ACTUAL OUTPUT string(3) "foo" 'foo' Notice: Undefined variable: a in /home/tm/tmp/php-5.0.3/Zend/tests/bug22836.php on line 7 Strict Standards: Only variable references should be returned by reference in /home/tm/tmp/php-5.0.3/Zend/tests/bug22836.php on line 7 string(3) "foo" 'foo' Notice: Undefined variable: a in /home/tm/tmp/php-5.0.3/Zend/tests/bug22836.php on line 7 Strict Standards: Only variable references should be returned by reference in /home/tm/tmp/php-5.0.3/Zend/tests/bug22836.php on line 7 NULL 'foo' Notice: Undefined variable: a in /home/tm/tmp/php-5.0.3/Zend/tests/bug22836.php on line 7 NULL 'foo' Notice: Undefined variable: a in /home/tm/tmp/php-5.0.3/Zend/tests/bug22836.php on line 7 NULL 'foo' Notice: Undefined variable: a in /home/tm/tmp/php-5.0.3/Zend/tests/bug22836.php on line 7 NULL 'foo' Notice: Undefined variable: a in /home/tm/tmp/php-5.0.3/Zend/tests/bug22836.php on line 7 NULL 'foo' Notice: Undefined variable: a in /home/tm/tmp/php-5.0.3/Zend/tests/bug22836.php on line 7 NULL 'foo' Notice: Undefined variable: a in /home/tm/tmp/php-5.0.3/Zend/tests/bug22836.php on line 7 ---- FAILED ================================================================================ 013+ NULL 013- string(3) "foo" 017+ NULL 018+ 'foo' 018- Strict Standards: Only variable references should be returned by reference in %s on line %d 019- string(3) "foo" 020+ Notice: Undefined variable: a in /home/tm/tmp/php-5.0.3/Zend/tests/bug22836.php on line 7 021+ NULL 022+ 'foo' 023+ 024+ Notice: Undefined variable: a in /home/tm/tmp/php-5.0.3/Zend/tests/bug22836.php on line 7 025+ NULL 026+ 'foo' 027+ 028+ Notice: Undefined variable: a in /home/tm/tmp/php-5.0.3/Zend/tests/bug22836.php on line 7 029+ NULL 030+ 'foo' 031+ 032+ Notice: Undefined variable: a in /home/tm/tmp/php-5.0.3/Zend/tests/bug22836.php on line 7 033+ NULL 023- 024- Strict Standards: Only variable references should be returned by reference in %s on line %d 025- string(3) "foo" 026- 'foo' 027- 028- Notice: Undefined variable: a in %s on line %d 029- 030- Strict Standards: Only variable references should be returned by reference in %s on line %d 031- string(3) "foo" 032- 'foo' 033- 034- Notice: Undefined variable: a in %s on line %d 035- 036- Strict Standards: Only variable references should be returned by reference in %s on line %d 037- string(3) "foo" 038- 'foo' 039- 040- Notice: Undefined variable: a in %s on line %d 041- 042- Strict Standards: Only variable references should be returned by reference in %s on line %d 043- string(3) "foo" 044- 'foo' 045- 046- Notice: Undefined variable: a in %s on line %d 047- 048- Strict Standards: Only variable references should be returned by reference in %s on line %d 049- string(3) "foo" 050- 'foo' 051- 052- Notice: Undefined variable: a in %s on line %d 053- 054- Strict Standards: Only variable references should be returned by reference in %s on line %d ================================================================================ ================================================================================ /home/tm/tmp/php-5.0.3/Zend/tests/bug28444.phpt ================================================================================ ---- EXPECTED OUTPUT object(Object)#%d (1) { ["x"]=> int(2) } int(2) int(3) Overloaded::__set(y,3) int(3) Overloaded::__get(y) int(3) Overloaded::__set(z,Object id #3) object(Object)#%d (1) { ["x"]=> int(4) } Overloaded::__get(z) int(4) Overloaded::__get(z) int(5) Overloaded::__get(z) int(6) ===DONE=== ---- ACTUAL OUTPUT object(Object)#2 (1) { ["x"]=> int(2) } int(2) int(3) Overloaded::__set(y,3) int(3) Overloaded::__get(y) int(3) Overloaded::__set(z,Object id #3) object(Object)#3 (1) { ["x"]=> int(4) } Overloaded::__get(z) int(4) Overloaded::__get(z) int(5) Fatal error: Cannot access undefined property for object with overloaded property access in /home/tm/tmp/php-5.0.3/Zend/tests/bug28444.php on line 45 ---- FAILED ================================================================================ 020+ 021+ Fatal error: Cannot access undefined property for object with overloaded property access in /home/tm/tmp/php-5.0.3/Zend/tests/bug28444.php on line 45 020- Overloaded::__get(z) 021- int(6) 022- ===DONE=== ================================================================================ ================================================================================ /home/tm/tmp/php-5.0.3/ext/dom/tests/dom003.phpt ================================================================================ ---- EXPECTED OUTPUT --- Catch exception with try/catch object(DOMException)#%d (6) { ["message:protected"]=> string(23) "Hierarchy Request Error" ["string:private"]=> string(0) "" ["file:protected"]=> string(%d) "%s/ext/dom/tests/dom003.php" ["line:protected"]=> int(8) ["trace:private"]=> array(0) { } ["code"]=> int(3) } --- Don't catch exception with try/catch Fatal error: Uncaught exception 'DOMException' with message 'Hierarchy Request Error' in %sdom003.php:%d Stack trace: #0 {main} thrown in %sdom003.php on line %d ---- ACTUAL OUTPUT --- Catch exception with try/catch object(DOMException)#3 (6) { ["message:protected"]=> string(23) "Hierarchy Request Error" ["string:private"]=> string(0) "" ["file:protected"]=> string(47) "/home/tm/tmp/php-5.0.3/ext/dom/tests/dom003.php" ["line:protected"]=> int(8) ["trace:private"]=> array(1) { [0]=> array(6) { ["file"]=> string(47) "/home/tm/tmp/php-5.0.3/ext/dom/tests/dom003.php" ["line"]=> int(8) ["function"]=> string(11) "appendChild" ["class"]=> string(10) "DOMElement" ["type"]=> string(2) "->" ["args"]=> array(1) { [0]=> object(DOMElement)#2 (0) { } } } } ["code"]=> int(3) } --- Don't catch exception with try/catch Fatal error: Uncaught exception 'DOMException' with message 'Hierarchy Request Error' in /home/tm/tmp/php-5.0.3/ext/dom/tests/dom003.php:13 Stack trace: #0 /home/tm/tmp/php-5.0.3/ext/dom/tests/dom003.php(13): DOMElement->appendChild(Object(DOMElement)) #1 {main} thrown in /home/tm/tmp/php-5.0.3/ext/dom/tests/dom003.php on line 13 ---- FAILED ================================================================================ 012+ array(1) { 013+ [0]=> 014+ array(6) { 015+ ["file"]=> 016+ string(47) "/home/tm/tmp/php-5.0.3/ext/dom/tests/dom003.php" 017+ ["line"]=> 018+ int(8) 019+ ["function"]=> 020+ string(11) "appendChild" 021+ ["class"]=> 022+ string(10) "DOMElement" 012- array(0) { 013- } 014- ["code"]=> 015- int(3) 016- } 017- --- Don't catch exception with try/catch 018- 019- Fatal error: Uncaught exception 'DOMException' with message 'Hierarchy Request Error' in %sdom003.php:%d 020- Stack trace: 021- #0 {main} 022- thrown in %sdom003.php on line %d 023+ ["type"]=> 024+ string(2) "->" 025+ ["args"]=> 026+ array(1) { 027+ [0]=> 028+ object(DOMElement)#2 (0) { 029+ } 030+ } 031+ } 032+ } 033+ ["code"]=> 034+ int(3) 035+ } 036+ --- Don't catch exception with try/catch 037+ 038+ Fatal error: Uncaught exception 'DOMException' with message 'Hierarchy Request Error' in /home/tm/tmp/php-5.0.3/ext/dom/tests/dom003.php:13 039+ Stack trace: 040+ #0 /home/tm/tmp/php-5.0.3/ext/dom/tests/dom003.php(13): DOMElement->appendChild(Object(DOMElement)) 041+ #1 {main} 042+ thrown in /home/tm/tmp/php-5.0.3/ext/dom/tests/dom003.php on line 13 ================================================================================ ================================================================================ /home/tm/tmp/php-5.0.3/ext/dom/tests/dom005.phpt ================================================================================ ---- EXPECTED OUTPUT --- save as XML <?xml version="1.0" standalone="yes"?> <!DOCTYPE html PUBLIC "-//W3C//DTD HTML 4.0 Transitional//EN" "http://www.w3.org/TR/REC-html40/loose.dtd"> <html><head><title>Hello world</title></head><body><p> This is a not well-formed<br/> html files with undeclared entities&#xA0; </p></body></html> --- save as HTML <!DOCTYPE html PUBLIC "-//W3C//DTD HTML 4.0 Transitional//EN" "http://www.w3.org/TR/REC-html40/loose.dtd"> <html> <head><title>Hello world</title></head> <body><p> This is a not well-formed<br> html files with undeclared entities&nbsp; </p></body> </html> ---- ACTUAL OUTPUT --- save as XML <?xml version="1.0" standalone="yes"?> <!DOCTYPE html PUBLIC "-//W3C//DTD HTML 4.0 Transitional//EN" "http://www.w3.org/TR/REC-html40/loose.dtd"> <html><head><title>Hello world</title></head><body><p> This is a not well-formed<br/> html files with undeclared entities  </p></body></html> --- save as HTML <!DOCTYPE html PUBLIC "-//W3C//DTD HTML 4.0 Transitional//EN" "http://www.w3.org/TR/REC-html40/loose.dtd"> <html> <head><title>Hello world</title></head> <body><p> This is a not well-formed<br> html files with undeclared entities&nbsp; </p></body> </html> ---- FAILED ================================================================================ 006+ html files with undeclared entities  006- html files with undeclared entities&#xA0; ================================================================================ ================================================================================ /home/tm/tmp/php-5.0.3/ext/iconv/tests/bug16069.phpt ================================================================================ ---- EXPECTED OUTPUT ¥ß¥ê¥Ð¡¼¥ë¥ß¥ê¥Ð¡¼¥ë¥ß¥ê¥Ð¡¼¥ë¥ß¥ê¥Ð¡¼¥ë¥ß¥ê¥Ð¡¼¥ë¥ß¥ê¥Ð¡¼¥ë¥ß¥ê¥Ð¡¼¥ë¥ß¥ê¥Ð¡¼¥ë¥ß¥ê¥Ð¡¼¥ë¥ß¥ê¥Ð¡¼¥ë¥ß¥ê¥Ð¡¼¥ë¥ß¥ê¥Ð¡¼¥ë¥ß¥ê¥Ð¡¼¥ë¥ß¥ê¥Ð¡¼¥ë¥ß¥ê¥Ð¡¼¥ë¥ß¥ê¥Ð¡¼¥ë¥ß¥ê¥Ð¡¼¥ë¥ß¥ê¥Ð¡¼¥ë¥ß¥ê¥Ð¡¼¥ë¥ß¥ê¥Ð¡¼¥ë¥ß¥ê¥Ð¡¼¥ë¥ß¥ê¥Ð¡¼¥ë¥ß¥ê¥Ð¡¼¥ë¥ß¥ê¥Ð¡¼¥ë¥ß¥ê¥Ð¡¼¥ë¥ß¥ê¥Ð¡¼¥ë¥ß¥ê¥Ð¡¼¥ë¥ß¥ê¥Ð¡¼¥ë¥ß¥ê¥Ð¡¼¥ë¥ß¥ê¥Ð¡¼¥ë¥ß¥ê¥Ð¡¼¥ë¥ß¥ê¥Ð¡¼¥ë¥ß¥ê¥Ð¡¼¥ë¥ß¥ê¥Ð¡¼¥ë¥ß¥ê¥Ð¡¼¥ë¥ß¥ê¥Ð¡¼¥ë¥ß¥ê¥Ð¡¼¥ë¥ß¥ê¥Ð¡¼¥ë¥ß¥ê¥Ð¡¼¥ë¥ß¥ê¥Ð¡¼¥ë(¡ë§¥¡ë) ---- ACTUAL OUTPUT ¥ß¥ê¥Ð¡¼¥ë¥ß¥ê¥Ð¡¼¥ë¥ß¥ê¥Ð¡¼¥ë¥ß¥ê¥Ð¡¼¥ë¥ß¥ê¥Ð¡¼¥ë¥ß¥ê¥Ð¡¼¥ë¥ß¥ê¥Ð¡¼¥ë¥ß¥ê¥Ð¡¼¥ë¥ß¥ê¥Ð¡¼¥ë¥ß¥ê¥Ð¡¼¥ë¥ß¥ê¥Ð¡¼¥ë¥ß¥ß¥ê¥Ð¡¼¥ë¥ß¥ê¥Ð¡¼¥ë¥ß¥ê¥Ð¡¼¥ë¥ß¥ê¥Ð¡¼¥ë¥ß¥ê¥Ð¡¼¥ë¥ß¥ê¥Ð¡¼¥ë¥ß¥ê¥Ð¡¼¥ë¥ß¥ê¥Ð¡¼¥ë¥ß¥ê¥Ð¡¼¥ë¥ß¥ê¥Ð¡¼¥ë¥ß¥ê¥Ð¡¼¥ë¥ß¥ê¥Ð¡¼¥ë¥ß¥ê¥Ð¡¼¥ë¥ß¥ê¥Ð¡¼¥ë¥ß¥ê¥Ð¡¼¥ë¥ß¥ê¥Ð¡¼¥ë¥ß¥ê¥Ð¡¼¥ë¥ß¥ê¥Ð¡¼¥ë¥ß¥ê¥Ð¡¼¥ë¥ß¥ê¥Ð¡¼¥ë¥ß¥ê¥Ð¡¼¥ë¥ß¥ê¥Ð¡¼¥ë¥ß¥ê¥Ð¡¼¥ë¥ß¥ê¥Ð¡¼¥ë¥ß¥ê¥Ð¡¼¥ë¥ß¥ê¥Ð¡¼¥ë¥ß¥ê¥Ð¡¼¥ë¥ß¥ê¥Ð¡¼¥ë¥ß¥ê¥Ð¡¼¥ë(¡ë§¥¡ë) ---- FAILED ================================================================================ 001+ ¥ß¥ê¥Ð¡¼¥ë¥ß¥ê¥Ð¡¼¥ë¥ß¥ê¥Ð¡¼¥ë¥ß¥ê¥Ð¡¼¥ë¥ß¥ê¥Ð¡¼¥ë¥ß¥ê¥Ð¡¼¥ë¥ß¥ê¥Ð¡¼¥ë¥ß¥ê¥Ð¡¼¥ë¥ß¥ê¥Ð¡¼¥ë¥ß¥ê¥Ð¡¼¥ë¥ß¥ê¥Ð¡¼¥ë¥ß¥ß¥ê¥Ð¡¼¥ë¥ß¥ê¥Ð¡¼¥ë¥ß¥ê¥Ð¡¼¥ë¥ß¥ê¥Ð¡¼¥ë¥ß¥ê¥Ð¡¼¥ë¥ß¥ê¥Ð¡¼¥ë¥ß¥ê¥Ð¡¼¥ë¥ß¥ê¥Ð¡¼¥ë¥ß¥ê¥Ð¡¼¥ë¥ß¥ê¥Ð¡¼¥ë¥ß¥ê¥Ð¡¼¥ë¥ß¥ê¥Ð¡¼¥ë¥ß¥ê¥Ð¡¼¥ë¥ß¥ê¥Ð¡¼¥ë¥ß¥ê¥Ð¡¼¥ë¥ß¥ê¥Ð¡¼¥ë¥ß¥ê¥Ð¡¼¥ë¥ß¥ê¥Ð¡¼¥ë¥ß¥ê¥Ð¡¼¥ë¥ß¥ê¥Ð¡¼¥ë¥ß¥ê¥Ð¡¼¥ë¥ß¥ê¥Ð¡¼¥ë¥ß¥ê¥Ð¡¼¥ë¥ß¥ê¥Ð¡¼¥ë¥ß¥ê¥Ð¡¼¥ë¥ß¥ê¥Ð¡¼¥ë¥ß¥ê¥Ð¡¼¥ë¥ß¥ê¥Ð¡¼¥ë¥ß¥ê¥Ð¡¼¥ë(¡ë§¥¡ë) 001- ¥ß¥ê¥Ð¡¼¥ë¥ß¥ê¥Ð¡¼¥ë¥ß¥ê¥Ð¡¼¥ë¥ß¥ê¥Ð¡¼¥ë¥ß¥ê¥Ð¡¼¥ë¥ß¥ê¥Ð¡¼¥ë¥ß¥ê¥Ð¡¼¥ë¥ß¥ê¥Ð¡¼¥ë¥ß¥ê¥Ð¡¼¥ë¥ß¥ê¥Ð¡¼¥ë¥ß¥ê¥Ð¡¼¥ë¥ß¥ê¥Ð¡¼¥ë¥ß¥ê¥Ð¡¼¥ë¥ß¥ê¥Ð¡¼¥ë¥ß¥ê¥Ð¡¼¥ë¥ß¥ê¥Ð¡¼¥ë¥ß¥ê¥Ð¡¼¥ë¥ß¥ê¥Ð¡¼¥ë¥ß¥ê¥Ð¡¼¥ë¥ß¥ê¥Ð¡¼¥ë¥ß¥ê¥Ð¡¼¥ë¥ß¥ê¥Ð¡¼¥ë¥ß¥ê¥Ð¡¼¥ë¥ß¥ê¥Ð¡¼¥ë¥ß¥ê¥Ð¡¼¥ë¥ß¥ê¥Ð¡¼¥ë¥ß¥ê¥Ð¡¼¥ë¥ß¥ê¥Ð¡¼¥ë¥ß¥ê¥Ð¡¼¥ë¥ß¥ê¥Ð¡¼¥ë¥ß¥ê¥Ð¡¼¥ë¥ß¥ê¥Ð¡¼¥ë¥ß¥ê¥Ð¡¼¥ë¥ß¥ê¥Ð¡¼¥ë¥ß¥ê¥Ð¡¼¥ë¥ß¥ê¥Ð¡¼¥ë¥ß¥ê¥Ð¡¼¥ë¥ß¥ê¥Ð¡¼¥ë¥ß¥ê¥Ð¡¼¥ë¥ß¥ê¥Ð¡¼¥ë(¡ë§¥¡ë) ================================================================================ ================================================================================ /home/tm/tmp/php-5.0.3/ext/iconv/tests/iconv_stream_filter.phpt ================================================================================ ---- EXPECTED OUTPUT string(20) "1b244224332473244b24" string(10) "41244f1b28" string(2) "42" string(20) "a4b3a4f3a4cba4c1a4cf" string(10) "69636f6e76" string(2) "0a" Warning: fread(): iconv stream filter ("ISO-2022-JP"=>"EUC-JP"): invalid multibyte sequence in %s on line %d string(0) "" string(0) "" string(0) "" ---- ACTUAL OUTPUT string(20) "1b244224332473244b24" string(10) "41244f1b28" string(2) "42" string(20) "a4b3a4f3a4cba4c1a4cf" string(10) "69636f6e76" string(2) "0a" string(20) "1b244f24332466245824" string(10) "4e24421b28" string(2) "4f" ---- FAILED ================================================================================ 007+ string(20) "1b244f24332466245824" 008+ string(10) "4e24421b28" 009+ string(2) "4f" 007- 008- Warning: fread(): iconv stream filter ("ISO-2022-JP"=>"EUC-JP"): invalid multibyte sequence in %s on line %d 009- string(0) "" 010- string(0) "" 011- string(0) "" ================================================================================ ================================================================================ /home/tm/tmp/php-5.0.3/ext/mbstring/tests/htmlent.phpt ================================================================================ ---- EXPECTED OUTPUT HTML-ENTITIES>UTF-8>HTML-ENTITIES test='&&;&@AB&#128;&#129;&#130;&auml;&ouml;&uuml;&euro;&lang;&rang;' ---- ACTUAL OUTPUT ---- FAILED ================================================================================ 001+ 001- HTML-ENTITIES>UTF-8>HTML-ENTITIES 002- test='&&;&@AB&#128;&#129;&#130;&auml;&ouml;&uuml;&euro;&lang;&rang;' ================================================================================ ================================================================================ /home/tm/tmp/php-5.0.3/ext/mbstring/tests/mb_output_handler_shift_jis.phpt ================================================================================ ---- EXPECTED OUTPUT string(73) "¥Æ¥¹¥ÈÍÑÆüËܸìʸ»úÎ󡣤³¤Î¥â¥¸¥å¡¼¥ë¤ÏPHP¤Ë¥Þ¥ë¥Á¥Ð¥¤¥È´Ø¿ô¤òÄ󶡤·¤Þ¤¹¡£" ---- ACTUAL OUTPUT ---- FAILED ================================================================================ 001+ 001- string(73) "¥Æ¥¹¥ÈÍÑÆüËܸìʸ»úÎ󡣤³¤Î¥â¥¸¥å¡¼¥ë¤ÏPHP¤Ë¥Þ¥ë¥Á¥Ð¥¤¥È´Ø¿ô¤òÄ󶡤·¤Þ¤¹¡£" ================================================================================ ================================================================================ /home/tm/tmp/php-5.0.3/ext/standard/tests/array/bug29992.phpt ================================================================================ ---- EXPECTED OUTPUT Array ( [0] => 1 [1] => 2 [2] => 3 ) int(1) int(2) int(3) int(1) int(2) int(3) int(1) int(2) int(3) int(1) int(2) int(3) Array ( [0] => 1 [1] => 2 [2] => 3 ) ===DONE=== ---- ACTUAL OUTPUT Array ( [0] => 1 [1] => 2 [2] => 3 ) int(1) int(2) int(3) int(1) int(2) int(3) int(1) int(2) int(3) int(1) int(2) int(2) Array ( [0] => 1 [1] => 2 [2] => 2 ) ===DONE=== ---- FAILED ================================================================================ 018+ int(2) 018- int(3) 023+ [2] => 2 023- [2] => 3 ================================================================================ ================================================================================ /home/tm/tmp/php-5.0.3/ext/standard/tests/time/bug20382.phpt ================================================================================ ---- EXPECTED OUTPUT tStamp=Wednesday 2004-10-27 17:17:17 CEST result=Monday 2004-11-01 00:00:00 CET wanted=Monday 2004-11-01 00:00:00 CET ---- ACTUAL OUTPUT tStamp=Wednesday 2004-10-27 17:17:17 CEST result=Sunday 2004-10-31 23:00:00 CET wanted=Monday 2004-11-01 00:00:00 CET ---- FAILED ================================================================================ 002+ result=Sunday 2004-10-31 23:00:00 CET 002- result=Monday 2004-11-01 00:00:00 CET ================================================================================ ================================================================================ /home/tm/tmp/php-5.0.3/ext/xml/tests/bug26614.phpt ================================================================================ ---- EXPECTED OUTPUT CDATA <DATA> at line 2, col 0 (byte 45) </DATA> at line 9, col 0 (byte 90) Comment <DATA> at line 2, col 0 (byte 45) </DATA> at line 9, col 0 (byte 90) Text <DATA> at line 2, col 0 (byte 45) </DATA> at line 9, col 0 (byte 90) ---- ACTUAL OUTPUT CDATA <DATA> at line 2, col 6 (byte 9) </DATA> at line 4, col 47 (byte 56) Comment <DATA> at line 2, col 6 (byte 9) </DATA> at line 9, col 7 (byte 56) Text <DATA> at line 2, col 6 (byte 9) </DATA> at line 9, col 10 (byte 56) ---- FAILED ================================================================================ 002+ <DATA> at line 2, col 6 (byte 9) 003+ </DATA> at line 4, col 47 (byte 56) 002- <DATA> at line 2, col 0 (byte 45) 003- </DATA> at line 9, col 0 (byte 90) 005+ <DATA> at line 2, col 6 (byte 9) 006+ </DATA> at line 9, col 7 (byte 56) 005- <DATA> at line 2, col 0 (byte 45) 006- </DATA> at line 9, col 0 (byte 90) 008+ <DATA> at line 2, col 6 (byte 9) 009+ </DATA> at line 9, col 10 (byte 56) 008- <DATA> at line 2, col 0 (byte 45) 009- </DATA> at line 9, col 0 (byte 90) ================================================================================ ================================================================================ BUILD ENVIRONMENT ================================================================================ OS: Linux - Linux localhost.localdomain 2.6.0-7smp #1 SMP Sun Apr 18 18:12:12 JST 2004 i686 Automake: automake (GNU automake) 1.7.6 Written by Tom Tromey <tromey@redhat.com>. Copyright 2003 Free Software Foundation, Inc. This is free software; see the source for copying conditions. There is NO warranty; not even for MERCHANTABILITY or FITNESS FOR A PARTICULAR PURPOSE. Autoconf: autoconf (GNU Autoconf) 2.57 Written by David J. MacKenzie and Akim Demaille. Copyright 2002 Free Software Foundation, Inc. This is free software; see the source for copying conditions. There is NO warranty; not even for MERCHANTABILITY or FITNESS FOR A PARTICULAR PURPOSE. Bundled Libtool: ltmain.sh (GNU libtool) 1.4.3 (1.922.2.110 2002/10/23 01:39:54) System Libtool: ltmain.sh (GNU libtool) 1.4.3 (1.922.2.111 2002/10/23 02:54:36) Compiler: /usr/lib/gcc-lib/i586-pc-linux/3.3.1/specs ¤«¤é spec ¤òÆÉ¤ß¹þ¤ßÃæ ¥³¥ó¥Õ¥£¥°¥ª¥×¥·¥ç¥ó: ../configure --prefix=/usr --mandir=/usr/share/man --infodir=/usr/share/info --enable-shared --enable-threads=posix --disable-checking --with-system-zlib --enable-__cxa_atexit --enable-languages=c,c++,objc,java,f77 --host=i586-pc-linux --build=i586-pc-linux --program-suffix=-3.3.1 ¥¹¥ì¥Ã¥É¥â¥Ç¥ë: posix gcc ¥Ð¡¼¥¸¥ç¥ó 3.3.1 Bison: bison (GNU Bison) 1.35 Copyright 1984, 1986, 1989, 1992, 2000, 2001, 2002 Free Software Foundation, Inc. This is free software; see the source for copying conditions. There is NO warranty; not even for MERCHANTABILITY or FITNESS FOR A PARTICULAR PURPOSE. [»²¹ÍÌõ -- ˡŪ¸úÎϤϱÑʸ¤¬Å¬ÍѤµ¤ì¤Þ¤¹] ¤³¤ì¤Ï¥Õ¥ê¡¼¥½¥Õ¥È¥¦¥§¥¢¤Ç¤¹ -- Ê£À½¤Ë¤Ä¤¤¤Æ¤Î¾ò·ï¤Ï¥½¡¼¥¹¤ò¸«¤Þ¤·¤ç¤¦¡£ °ìÀÚ¤ÎÊݾڤϤ¢¤ê¤Þ¤»¤ó -- ¾¦¶ÈÀ­¤äÌÜŪŬ¹çÀ­¤Ë¤Ä¤¤¤Æ¤ÎÊݾڤ¹¤é¤¢¤ê¤Þ¤»¤ó¡£ Libraries: libcrypt.so.1 => /lib/libcrypt.so.1 (0x4002b000) libresolv.so.2 => /lib/libresolv.so.2 (0x40058000) libm.so.6 => /lib/libm.so.6 (0x40069000) libdl.so.2 => /lib/libdl.so.2 (0x4008c000) libnsl.so.1 => /lib/libnsl.so.1 (0x4008f000) libz.so.1 => /usr/lib/libz.so.1 (0x400a3000) libxml2.so.2 => /usr/lib/libxml2.so.2 (0x400b1000) libpthread.so.0 => /lib/libpthread.so.0 (0x40191000) libc.so.6 => /lib/libc.so.6 (0x401e3000) /lib/ld-linux.so.2 => /lib/ld-linux.so.2 (0x40000000) User's E-mail: toshio at mtj dot biglobe dot ne dot jp ================================================================================ PHPINFO ================================================================================ phpinfo() PHP Version => 5.0.3 System => Linux localhost.localdomain 2.6.0-7smp #1 SMP Sun Apr 18 18:12:12 JST 2004 i686 Build Date => Feb 18 2005 18:37:06 Configure Command => './configure' '--prefix=/usr/local/php5' '--with-apxs2=/usr/local/apache2/bin/apxs' '--with-config-file-path=/usr/local/php5/etc' '--with-config-file-scan-dir=/usr/local/php5/etc/php.d' '--with-layout=GNU' '--enable-mbstring' '--with-libmbfl' '--enable-mbregex' '--with-pgsql=shared,/usr/local/pgsql' '--with-regex=system' Server API => Command Line Interface Virtual Directory Support => disabled Configuration File (php.ini) Path => /usr/local/php5/etc Scan this dir for additional .ini files => /usr/local/php5/etc/php.d PHP API => 20031224 PHP Extension => 20041030 Zend Extension => 220040412 Debug Build => no Thread Safety => disabled IPv6 Support => enabled Registered PHP Streams => php, file, http, ftp Registered Stream Socket Transports => tcp, udp, unix, udg This program makes use of the Zend Scripting Language Engine: Zend Engine v2.0.3, Copyright (c) 1998-2004 Zend Technologies _______________________________________________________________________ Configuration PHP Core Directive => Local Value => Master Value allow_call_time_pass_reference => On => On allow_url_fopen => On => On always_populate_raw_post_data => Off => Off arg_separator.input => & => & arg_separator.output => & => & asp_tags => Off => Off auto_append_file => no value => no value auto_globals_jit => On => On auto_prepend_file => no value => no value browscap => no value => no value default_charset => no value => no value default_mimetype => text/html => text/html define_syslog_variables => Off => Off disable_classes => no value => no value disable_functions => no value => no value display_errors => On => On display_startup_errors => Off => Off doc_root => no value => no value docref_ext => no value => no value docref_root => no value => no value enable_dl => On => On error_append_string => no value => no value error_log => no value => no value error_prepend_string => no value => no value error_reporting => no value => no value expose_php => On => On extension_dir => /usr/local/php5/lib/php/20041030 => /usr/local/php5/lib/php/20041030 file_uploads => On => On highlight.bg => #FFFFFF => #FFFFFF highlight.comment => #FF8000 => #FF8000 highlight.default => #0000BB => #0000BB highlight.html => #000000 => #000000 highlight.keyword => #007700 => #007700 highlight.string => #DD0000 => #DD0000 html_errors => Off => On ignore_repeated_errors => Off => Off ignore_repeated_source => Off => Off ignore_user_abort => Off => Off implicit_flush => On => Off include_path => .:/usr/local/php5/share/pear => .:/usr/local/php5/share/pear log_errors => Off => Off log_errors_max_len => 1024 => 1024 magic_quotes_gpc => On => On magic_quotes_runtime => Off => Off magic_quotes_sybase => Off => Off mail.force_extra_parameters => no value => no value max_execution_time => 0 => 30 max_input_time => -1 => -1 open_basedir => no value => no value output_buffering => 0 => 0 output_handler => no value => no value post_max_size => 8M => 8M precision => 14 => 14 register_argc_argv => On => On register_globals => Off => Off register_long_arrays => On => On report_memleaks => On => On report_zend_debug => Off => Off safe_mode => Off => Off safe_mode_exec_dir => /usr/local/php/bin => /usr/local/php/bin safe_mode_gid => Off => Off safe_mode_include_dir => no value => no value sendmail_from => no value => no value sendmail_path => /usr/sbin/sendmail -t -i => /usr/sbin/sendmail -t -i serialize_precision => 100 => 100 short_open_tag => On => On SMTP => localhost => localhost smtp_port => 25 => 25 sql.safe_mode => Off => Off track_errors => Off => Off unserialize_callback_func => no value => no value upload_max_filesize => 2M => 2M upload_tmp_dir => no value => no value user_dir => no value => no value variables_order => EGPCS => EGPCS xmlrpc_error_number => 0 => 0 xmlrpc_errors => Off => Off y2k_compliance => On => On zend.ze1_compatibility_mode => Off => Off ctype ctype functions => enabled dom DOM/XML => enabled DOM/XML API Version => 20031129 libxml Version => 2.6.2 HTML Support => enabled XPath Support => enabled XPointer Support => enabled Schema Support => enabled RelaxNG Support => enabled iconv iconv support => enabled iconv implementation => glibc iconv library version => 2.3.2 Directive => Local Value => Master Value iconv.input_encoding => ISO-8859-1 => ISO-8859-1 iconv.internal_encoding => ISO-8859-1 => ISO-8859-1 iconv.output_encoding => ISO-8859-1 => ISO-8859-1 libxml libXML support => active libXML Version => 2.6.2 libXML streams => enabled mbstring Multibyte Support => enabled Multibyte string engine => libmbfl Multibyte (japanese) regex support => enabled Multibyte regex (oniguruma) version => 2.2.4 mbstring extension makes use of "streamable kanji code filter and converter", which is distributed under the GNU Lesser General Public License version 2.1. Directive => Local Value => Master Value mbstring.detect_order => no value => no value mbstring.encoding_translation => Off => Off mbstring.func_overload => 0 => 0 mbstring.http_input => pass => pass mbstring.http_output => pass => pass mbstring.internal_encoding => ISO-8859-1 => no value mbstring.language => neutral => neutral mbstring.substitute_character => no value => no value pcre PCRE (Perl Compatible Regular Expressions) Support => enabled PCRE Library Version => 4.5 01-December-2003 posix Revision => $Revision: 1.60 $ session Session Support => enabled Registered save handlers => files user sqlite Registered serializer handlers => php php_binary Directive => Local Value => Master Value session.auto_start => Off => Off session.bug_compat_42 => On => On session.bug_compat_warn => On => On session.cache_expire => 180 => 180 session.cache_limiter => nocache => nocache session.cookie_domain => no value => no value session.cookie_lifetime => 0 => 0 session.cookie_path => / => / session.cookie_secure => Off => Off session.entropy_file => no value => no value session.entropy_length => 0 => 0 session.gc_divisor => 100 => 100 session.gc_maxlifetime => 1440 => 1440 session.gc_probability => 1 => 1 session.hash_bits_per_character => 4 => 4 session.hash_function => 0 => 0 session.name => PHPSESSID => PHPSESSID session.referer_check => no value => no value session.save_handler => files => files session.save_path => no value => no value session.serialize_handler => php => php session.use_cookies => On => On session.use_only_cookies => Off => Off session.use_trans_sid => 0 => 0 SimpleXML Simplexml support => enabled Revision => $Revision: 1.139.2.4 $ Schema support => enabled SPL SPL support => enabled Interfaces => RecursiveIterator, SeekableIterator Classes => ArrayObject, ArrayIterator, CachingIterator, CachingRecursiveIterator, DirectoryIterator, FilterIterator, LimitIterator, ParentIterator, RecursiveDirectoryIterator, RecursiveIteratorIterator, SimpleXMLIterator SQLite SQLite support => enabled PECL Module version => 2.0-dev $Id: sqlite.c,v 1.146.2.3 2004/09/26 01:41:40 wez Exp $ SQLite Library => 2.8.14 SQLite Encoding => iso8859 Directive => Local Value => Master Value sqlite.assoc_case => 0 => 0 standard Regex Library => Bundled library enabled Dynamic Library Support => enabled Path to sendmail => /usr/sbin/sendmail -t -i Directive => Local Value => Master Value assert.active => 1 => 1 assert.bail => 0 => 0 assert.callback => no value => no value assert.quiet_eval => 0 => 0 assert.warning => 1 => 1 auto_detect_line_endings => 0 => 0 date.default_latitude => 31.7667 => 31.7667 date.default_longitude => 35.2333 => 35.2333 date.sunrise_zenith => 90.83 => 90.83 date.sunset_zenith => 90.83 => 90.83 default_socket_timeout => 60 => 60 safe_mode_allowed_env_vars => PHP_ => PHP_ safe_mode_protected_env_vars => LD_LIBRARY_PATH => LD_LIBRARY_PATH url_rewriter.tags => a=href,area=href,frame=src,form=,fieldset= => a=href,area=href,frame=src,form=,fieldset= user_agent => no value => no value tokenizer Tokenizer Support => enabled xml XML Support => active XML Namespace Support => active libxml2 Version => 2.6.2 Additional Modules Module Name Environment Variable => Value PWD => /home/tm/tmp/php-5.0.3 XAUTHORITY => /home/tm/.Xauthority KONSOLE_DCOP => DCOPRef(konsole-22169,konsole) UNICODEMAP_JP => cp932,nec-vdc MAKEFLAGS => SCRIPT_FILENAME => GS_LIB => /home/tm/.kde/share/fonts MFLAGS => G_BROKEN_FILENAMES => 1 HOSTNAME => localhost.localdomain HISTFILESIZE => 1000 QTDIR => /usr/lib/qt3 HTT_DISABLE_STATUS_WINDOW => t KONSOLE_DCOP_SESSION => DCOPRef(konsole-22169,session-1) HTT_GENERATES_KANAKEY => t LESSOPEN => |/usr/bin/lesspipe.sh %s MANPATH => /usr/lib/qt3/doc/man:/usr/lib/qt3/doc/man: CC => gcc HTT_HELP_BROWSER => /usr/bin/mozilla ENV => /home/tm/.bashrc GDMSESSION => Default KDEDIR => /usr DESKTOP_SESSION => Default LESS => -X REQUEST_METHOD => HISTCONTROL => ignoredups USER => tm MACHTYPE => i586-pc-linux-gnu TEST_PHP_SRCDIR => /home/tm/tmp/php-5.0.3 KDE_MULTIHEAD => false MAIL => /var/spool/mail/tm GTK_RC_FILES => /etc/gtk/gtkrc:/home/tm/.gtkrc:/home/tm/.gtkrc-kde PATH_TRANSLATED => XMODIFIERS => @im=htt LANG => ja_JP.eucJP QUERY_STRING => CONTENT_LENGTH => JAVA_HOME => /usr/java/j2sdk1.4.2_04 MAKELEVEL => 1 COLORTERM => DISPLAY => :0.0 SSH_AGENT_PID => 1253 LOGNAME => tm SHLVL => 7 REDIRECT_STATUS => TEST_PHP_EXECUTABLE => /home/tm/tmp/php-5.0.3/sapi/cli/php _ => /home/tm/tmp/php-5.0.3/sapi/cli/php SESSION_MANAGER => local/localhost.localdomain:/tmp/.ICE-unix/1454 SHELL => /bin/sh USERNAME => HOSTTYPE => i586 OSTYPE => linux-gnu HTT_USES_LINUX_XKEYSYM => t HISTSIZE => 1000 SSH_AUTH_SOCK => deleted HOME => /home/tm TERM => konsole PATH => /usr/lib/qt3/bin/:/usr/bin:/usr/lib/qt3/bin:/usr/java/j2sdk1.4.2_04/bin:/usr/lib/qt3/bin:/usr/java/j2sdk1.4.2_04/bin:/bin:/usr/bin:/usr/X11R6/bin:/usr/local/bin:/usr/bin:/usr/X11R6/bin:/usr/X11R6/bin SSH_TTY => deleted CONTENT_TYPE => PHP Variables Variable => Value _SERVER["PWD"] => /home/tm/tmp/php-5.0.3 _SERVER["XAUTHORITY"] => /home/tm/.Xauthority _SERVER["KONSOLE_DCOP"] => DCOPRef(konsole-22169,konsole) _SERVER["UNICODEMAP_JP"] => cp932,nec-vdc _SERVER["MAKEFLAGS"] => _SERVER["SCRIPT_FILENAME"] => _SERVER["GS_LIB"] => /home/tm/.kde/share/fonts _SERVER["MFLAGS"] => _SERVER["G_BROKEN_FILENAMES"] => 1 _SERVER["HOSTNAME"] => localhost.localdomain _SERVER["HISTFILESIZE"] => 1000 _SERVER["QTDIR"] => /usr/lib/qt3 _SERVER["HTT_DISABLE_STATUS_WINDOW"] => t _SERVER["KONSOLE_DCOP_SESSION"] => DCOPRef(konsole-22169,session-1) _SERVER["HTT_GENERATES_KANAKEY"] => t _SERVER["LESSOPEN"] => |/usr/bin/lesspipe.sh %s _SERVER["MANPATH"] => /usr/lib/qt3/doc/man:/usr/lib/qt3/doc/man: _SERVER["CC"] => gcc _SERVER["HTT_HELP_BROWSER"] => /usr/bin/mozilla _SERVER["ENV"] => /home/tm/.bashrc _SERVER["GDMSESSION"] => Default _SERVER["KDEDIR"] => /usr _SERVER["DESKTOP_SESSION"] => Default _SERVER["LESS"] => -X _SERVER["REQUEST_METHOD"] => _SERVER["HISTCONTROL"] => ignoredups _SERVER["USER"] => tm _SERVER["MACHTYPE"] => i586-pc-linux-gnu _SERVER["TEST_PHP_SRCDIR"] => /home/tm/tmp/php-5.0.3 _SERVER["KDE_MULTIHEAD"] => false _SERVER["MAIL"] => /var/spool/mail/tm _SERVER["GTK_RC_FILES"] => /etc/gtk/gtkrc:/home/tm/.gtkrc:/home/tm/.gtkrc-kde _SERVER["PATH_TRANSLATED"] => _SERVER["XMODIFIERS"] => @im=htt _SERVER["LANG"] => ja_JP.eucJP _SERVER["QUERY_STRING"] => _SERVER["CONTENT_LENGTH"] => _SERVER["JAVA_HOME"] => /usr/java/j2sdk1.4.2_04 _SERVER["MAKELEVEL"] => 1 _SERVER["COLORTERM"] => _SERVER["DISPLAY"] => :0.0 _SERVER["SSH_AGENT_PID"] => 1253 _SERVER["LOGNAME"] => tm _SERVER["SHLVL"] => 7 _SERVER["REDIRECT_STATUS"] => _SERVER["TEST_PHP_EXECUTABLE"] => /home/tm/tmp/php-5.0.3/sapi/cli/php _SERVER["_"] => /home/tm/tmp/php-5.0.3/sapi/cli/php _SERVER["SESSION_MANAGER"] => local/localhost.localdomain:/tmp/.ICE-unix/1454 _SERVER["SHELL"] => /bin/sh _SERVER["USERNAME"] => _SERVER["HOSTTYPE"] => i586 _SERVER["OSTYPE"] => linux-gnu _SERVER["HTT_USES_LINUX_XKEYSYM"] => t _SERVER["HISTSIZE"] => 1000 _SERVER["SSH_AUTH_SOCK"] => deleted _SERVER["HOME"] => /home/tm _SERVER["TERM"] => konsole _SERVER["PATH"] => /usr/lib/qt3/bin/:/usr/bin:/usr/lib/qt3/bin:/usr/java/j2sdk1.4.2_04/bin:/usr/lib/qt3/bin:/usr/java/j2sdk1.4.2_04/bin:/bin:/usr/bin:/usr/X11R6/bin:/usr/local/bin:/usr/bin:/usr/X11R6/bin:/usr/X11R6/bin _SERVER["SSH_TTY"] => deleted _SERVER["CONTENT_TYPE"] => _SERVER["PHP_SELF"] => _SERVER["SCRIPT_NAME"] => _SERVER["DOCUMENT_ROOT"] => _SERVER["argv"] => Array ( ) _SERVER["argc"] => 0 _ENV["PWD"] => /home/tm/tmp/php-5.0.3 _ENV["XAUTHORITY"] => /home/tm/.Xauthority _ENV["KONSOLE_DCOP"] => DCOPRef(konsole-22169,konsole) _ENV["UNICODEMAP_JP"] => cp932,nec-vdc _ENV["MAKEFLAGS"] => _ENV["SCRIPT_FILENAME"] => _ENV["GS_LIB"] => /home/tm/.kde/share/fonts _ENV["MFLAGS"] => _ENV["G_BROKEN_FILENAMES"] => 1 _ENV["HOSTNAME"] => localhost.localdomain _ENV["HISTFILESIZE"] => 1000 _ENV["QTDIR"] => /usr/lib/qt3 _ENV["HTT_DISABLE_STATUS_WINDOW"] => t _ENV["KONSOLE_DCOP_SESSION"] => DCOPRef(konsole-22169,session-1) _ENV["HTT_GENERATES_KANAKEY"] => t _ENV["LESSOPEN"] => |/usr/bin/lesspipe.sh %s _ENV["MANPATH"] => /usr/lib/qt3/doc/man:/usr/lib/qt3/doc/man: _ENV["CC"] => gcc _ENV["HTT_HELP_BROWSER"] => /usr/bin/mozilla _ENV["ENV"] => /home/tm/.bashrc _ENV["GDMSESSION"] => Default _ENV["KDEDIR"] => /usr _ENV["DESKTOP_SESSION"] => Default _ENV["LESS"] => -X _ENV["REQUEST_METHOD"] => _ENV["HISTCONTROL"] => ignoredups _ENV["USER"] => tm _ENV["MACHTYPE"] => i586-pc-linux-gnu _ENV["TEST_PHP_SRCDIR"] => /home/tm/tmp/php-5.0.3 _ENV["KDE_MULTIHEAD"] => false _ENV["MAIL"] => /var/spool/mail/tm _ENV["GTK_RC_FILES"] => /etc/gtk/gtkrc:/home/tm/.gtkrc:/home/tm/.gtkrc-kde _ENV["PATH_TRANSLATED"] => _ENV["XMODIFIERS"] => @im=htt _ENV["LANG"] => ja_JP.eucJP _ENV["QUERY_STRING"] => _ENV["CONTENT_LENGTH"] => _ENV["JAVA_HOME"] => /usr/java/j2sdk1.4.2_04 _ENV["MAKELEVEL"] => 1 _ENV["COLORTERM"] => _ENV["DISPLAY"] => :0.0 _ENV["SSH_AGENT_PID"] => 1253 _ENV["LOGNAME"] => tm _ENV["SHLVL"] => 7 _ENV["REDIRECT_STATUS"] => _ENV["TEST_PHP_EXECUTABLE"] => /home/tm/tmp/php-5.0.3/sapi/cli/php _ENV["_"] => /home/tm/tmp/php-5.0.3/sapi/cli/php _ENV["SESSION_MANAGER"] => local/localhost.localdomain:/tmp/.ICE-unix/1454 _ENV["SHELL"] => /bin/sh _ENV["USERNAME"] => _ENV["HOSTTYPE"] => i586 _ENV["OSTYPE"] => linux-gnu _ENV["HTT_USES_LINUX_XKEYSYM"] => t _ENV["HISTSIZE"] => 1000 _ENV["SSH_AUTH_SOCK"] => deleted _ENV["HOME"] => /home/tm _ENV["TERM"] => konsole _ENV["PATH"] => /usr/lib/qt3/bin/:/usr/bin:/usr/lib/qt3/bin:/usr/java/j2sdk1.4.2_04/bin:/usr/lib/qt3/bin:/usr/java/j2sdk1.4.2_04/bin:/bin:/usr/bin:/usr/X11R6/bin:/usr/local/bin:/usr/bin:/usr/X11R6/bin:/usr/X11R6/bin _ENV["SSH_TTY"] => deleted _ENV["CONTENT_TYPE"] => PHP License This program is free software; you can redistribute it and/or modify it under the terms of the PHP License as published by the PHP Group and included in the distribution in the file: LICENSE This program is distributed in the hope that it will be useful, but WITHOUT ANY WARRANTY; without even the implied warranty of MERCHANTABILITY or FITNESS FOR A PARTICULAR PURPOSE. If you did not receive a copy of the PHP license, or have any questions about PHP licensing, please contact license@php.net.

« previous php.qa (#23758) next »