Test results for 5.0.3 [failed]

From: Date: Fri, 18 Feb 2005 09:54:02 +0000
Subject: Test results for 5.0.3 [failed]
Groups: php.qa 
Request: Send a blank email to php-qa+get-23759@lists.php.net to get a copy of this message
===================================================================== FAILED TEST SUMMARY --------------------------------------------------------------------- Test for buffering in core functions with implicit flush off [tests/func/008.phpt] Convert warnings to exceptions [tests/lang/038.phpt] Bug #29944 (function defined in switch crashes PHP) [tests/lang/bug29944.phpt] Bug #22836 (returning references to NULL) [Zend/tests/bug22836.phpt] Bug #28444 (Cannot access undefined property for object with overloaded property access) [Zend/tests/bug28444.phpt] Test 3: Exception Test [ext/dom/tests/dom003.phpt] Test 4: Streams Test [ext/dom/tests/dom004.phpt] Test: Xinclude and Streams [ext/dom/tests/dom_xinclude.phpt] Bug #16069 [ext/iconv/tests/bug16069.phpt] iconv stream filter [ext/iconv/tests/iconv_stream_filter.phpt] Bug #29992 (foreach by reference corrupts the array) [ext/standard/tests/array/bug29992.phpt] fopencookie detected and working (or cast mechanism works) [ext/standard/tests/file/fopencookie.phpt] Bug #24142 (round() problems) [ext/standard/tests/math/bug24142.phpt] Bug #25694 (round() and number_format() inconsistency) [ext/standard/tests/math/bug25694.phpt] Bug #20382 (strtotime ("Monday", $date) produces wrong result on DST changeover) [ext/standard/tests/time/bug20382.phpt] wddx deserialization test [ext/wddx/tests/001.phpt] Bug #26614 (CDATA sections skipped on line count) [ext/xml/tests/bug26614.phpt] ===================================================================== ===================================================================== TEST RESULT SUMMARY --------------------------------------------------------------------- Exts skipped : 60 Exts tested : 25 --------------------------------------------------------------------- Number of tests : 1291 824 Tests skipped : 467 (36.2%) -------- Tests warned : 0 (0.0%) (0.0%) Tests failed : 17 (1.3%) (2.1%) Tests passed : 807 (62.5%) (97.9%) --------------------------------------------------------------------- Time taken : 44 seconds ===================================================================== ===================================================================== FAILED TEST SUMMARY --------------------------------------------------------------------- Test for buffering in core functions with implicit flush off [tests/func/008.phpt] Convert warnings to exceptions [tests/lang/038.phpt] Bug #29944 (function defined in switch crashes PHP) [tests/lang/bug29944.phpt] Bug #22836 (returning references to NULL) [Zend/tests/bug22836.phpt] Bug #28444 (Cannot access undefined property for object with overloaded property access) [Zend/tests/bug28444.phpt] Test 3: Exception Test [ext/dom/tests/dom003.phpt] Test 4: Streams Test [ext/dom/tests/dom004.phpt] Test: Xinclude and Streams [ext/dom/tests/dom_xinclude.phpt] Bug #16069 [ext/iconv/tests/bug16069.phpt] iconv stream filter [ext/iconv/tests/iconv_stream_filter.phpt] Bug #29992 (foreach by reference corrupts the array) [ext/standard/tests/array/bug29992.phpt] fopencookie detected and working (or cast mechanism works) [ext/standard/tests/file/fopencookie.phpt] Bug #24142 (round() problems) [ext/standard/tests/math/bug24142.phpt] Bug #25694 (round() and number_format() inconsistency) [ext/standard/tests/math/bug25694.phpt] Bug #20382 (strtotime ("Monday", $date) produces wrong result on DST changeover) [ext/standard/tests/time/bug20382.phpt] wddx deserialization test [ext/wddx/tests/001.phpt] Bug #26614 (CDATA sections skipped on line count) [ext/xml/tests/bug26614.phpt] ===================================================================== ================================================================================ /home/koguma/lamp/php-5.0.3/tests/func/008.phpt ================================================================================ ---- EXPECTED OUTPUT 'foo1' 'foo2' ---- ACTUAL OUTPUT ---- FAILED ================================================================================ 001- 'foo1' 003- 'foo2' ================================================================================ ================================================================================ /home/koguma/lamp/php-5.0.3/tests/lang/038.phpt ================================================================================ ---- EXPECTED OUTPUT string(15) "Error2Exception" string(5) "fopen" ===DONE=== ---- ACTUAL OUTPUT string(15) "Error2Exception" string(15) "Error2Exception" ===DONE=== ---- FAILED ================================================================================ 002+ string(15) "Error2Exception" 002- string(5) "fopen" ================================================================================ ================================================================================ /home/koguma/lamp/php-5.0.3/tests/lang/bug29944.phpt ================================================================================ ---- EXPECTED OUTPUT 1 ===DONE=== ---- ACTUAL OUTPUT ---- FAILED ================================================================================ 001+ 001- 1 002- ===DONE=== ================================================================================ ================================================================================ /home/koguma/lamp/php-5.0.3/Zend/tests/bug22836.phpt ================================================================================ ---- EXPECTED OUTPUT string(3) "foo" 'foo' Notice: Undefined variable: a in %s on line %d Strict Standards: Only variable references should be returned by reference in %s on line %d string(3) "foo" 'foo' Notice: Undefined variable: a in %s on line %d Strict Standards: Only variable references should be returned by reference in %s on line %d string(3) "foo" 'foo' Notice: Undefined variable: a in %s on line %d Strict Standards: Only variable references should be returned by reference in %s on line %d string(3) "foo" 'foo' Notice: Undefined variable: a in %s on line %d Strict Standards: Only variable references should be returned by reference in %s on line %d string(3) "foo" 'foo' Notice: Undefined variable: a in %s on line %d Strict Standards: Only variable references should be returned by reference in %s on line %d string(3) "foo" 'foo' Notice: Undefined variable: a in %s on line %d Strict Standards: Only variable references should be returned by reference in %s on line %d string(3) "foo" 'foo' Notice: Undefined variable: a in %s on line %d Strict Standards: Only variable references should be returned by reference in %s on line %d string(3) "foo" 'foo' Notice: Undefined variable: a in %s on line %d Strict Standards: Only variable references should be returned by reference in %s on line %d string(3) "foo" 'foo' Notice: Undefined variable: a in %s on line %d Strict Standards: Only variable references should be returned by reference in %s on line %d ---- ACTUAL OUTPUT string(3) "foo" 'foo' Notice: Undefined variable: a in /home/koguma/lamp/php-5.0.3/Zend/tests/bug22836.php on line 7 Strict Standards: Only variable references should be returned by reference in /home/koguma/lamp/php-5.0.3/Zend/tests/bug22836.php on line 7 string(3) "foo" 'foo' Notice: Undefined variable: a in /home/koguma/lamp/php-5.0.3/Zend/tests/bug22836.php on line 7 Strict Standards: Only variable references should be returned by reference in /home/koguma/lamp/php-5.0.3/Zend/tests/bug22836.php on line 7 NULL 'foo' Notice: Undefined variable: a in /home/koguma/lamp/php-5.0.3/Zend/tests/bug22836.php on line 7 NULL 'foo' Notice: Undefined variable: a in /home/koguma/lamp/php-5.0.3/Zend/tests/bug22836.php on line 7 NULL 'foo' Notice: Undefined variable: a in /home/koguma/lamp/php-5.0.3/Zend/tests/bug22836.php on line 7 NULL 'foo' Notice: Undefined variable: a in /home/koguma/lamp/php-5.0.3/Zend/tests/bug22836.php on line 7 NULL 'foo' Notice: Undefined variable: a in /home/koguma/lamp/php-5.0.3/Zend/tests/bug22836.php on line 7 NULL 'foo' Notice: Undefined variable: a in /home/koguma/lamp/php-5.0.3/Zend/tests/bug22836.php on line 7 ---- FAILED ================================================================================ 013+ NULL 013- string(3) "foo" 017+ NULL 018+ 'foo' 018- Strict Standards: Only variable references should be returned by reference in %s on line %d 019- string(3) "foo" 020+ Notice: Undefined variable: a in /home/koguma/lamp/php-5.0.3/Zend/tests/bug22836.php on line 7 021+ NULL 022+ 'foo' 023+ 024+ Notice: Undefined variable: a in /home/koguma/lamp/php-5.0.3/Zend/tests/bug22836.php on line 7 025+ NULL 026+ 'foo' 027+ 028+ Notice: Undefined variable: a in /home/koguma/lamp/php-5.0.3/Zend/tests/bug22836.php on line 7 029+ NULL 030+ 'foo' 031+ 032+ Notice: Undefined variable: a in /home/koguma/lamp/php-5.0.3/Zend/tests/bug22836.php on line 7 033+ NULL 023- 024- Strict Standards: Only variable references should be returned by reference in %s on line %d 025- string(3) "foo" 026- 'foo' 027- 028- Notice: Undefined variable: a in %s on line %d 029- 030- Strict Standards: Only variable references should be returned by reference in %s on line %d 031- string(3) "foo" 032- 'foo' 033- 034- Notice: Undefined variable: a in %s on line %d 035- 036- Strict Standards: Only variable references should be returned by reference in %s on line %d 037- string(3) "foo" 038- 'foo' 039- 040- Notice: Undefined variable: a in %s on line %d 041- 042- Strict Standards: Only variable references should be returned by reference in %s on line %d 043- string(3) "foo" 044- 'foo' 045- 046- Notice: Undefined variable: a in %s on line %d 047- 048- Strict Standards: Only variable references should be returned by reference in %s on line %d 049- string(3) "foo" 050- 'foo' 051- 052- Notice: Undefined variable: a in %s on line %d 053- 054- Strict Standards: Only variable references should be returned by reference in %s on line %d ================================================================================ ================================================================================ /home/koguma/lamp/php-5.0.3/Zend/tests/bug28444.phpt ================================================================================ ---- EXPECTED OUTPUT object(Object)#%d (1) { ["x"]=> int(2) } int(2) int(3) Overloaded::__set(y,3) int(3) Overloaded::__get(y) int(3) Overloaded::__set(z,Object id #3) object(Object)#%d (1) { ["x"]=> int(4) } Overloaded::__get(z) int(4) Overloaded::__get(z) int(5) Overloaded::__get(z) int(6) ===DONE=== ---- ACTUAL OUTPUT object(Object)#2 (1) { ["x"]=> int(2) } int(2) int(3) Overloaded::__set(y,3) int(3) Overloaded::__get(y) int(3) Overloaded::__set(z,Object id #3) object(Object)#3 (1) { ["x"]=> int(4) } Overloaded::__get(z) int(4) Overloaded::__get(z) int(5) Fatal error: Cannot access undefined property for object with overloaded property access in /home/koguma/lamp/php-5.0.3/Zend/tests/bug28444.php on line 45 ---- FAILED ================================================================================ 020+ 021+ Fatal error: Cannot access undefined property for object with overloaded property access in /home/koguma/lamp/php-5.0.3/Zend/tests/bug28444.php on line 45 020- Overloaded::__get(z) 021- int(6) 022- ===DONE=== ================================================================================ ================================================================================ /home/koguma/lamp/php-5.0.3/ext/dom/tests/dom003.phpt ================================================================================ ---- EXPECTED OUTPUT --- Catch exception with try/catch object(DOMException)#%d (6) { ["message:protected"]=> string(23) "Hierarchy Request Error" ["string:private"]=> string(0) "" ["file:protected"]=> string(%d) "%s/ext/dom/tests/dom003.php" ["line:protected"]=> int(8) ["trace:private"]=> array(0) { } ["code"]=> int(3) } --- Don't catch exception with try/catch Fatal error: Uncaught exception 'DOMException' with message 'Hierarchy Request Error' in %sdom003.php:%d Stack trace: #0 {main} thrown in %sdom003.php on line %d ---- ACTUAL OUTPUT --- Catch exception with try/catch object(DOMException)#3 (6) { ["message:protected"]=> string(23) "Hierarchy Request Error" ["string:private"]=> string(0) "" ["file:protected"]=> string(52) "/home/koguma/lamp/php-5.0.3/ext/dom/tests/dom003.php" ["line:protected"]=> int(8) ["trace:private"]=> array(1) { [0]=> array(6) { ["file"]=> string(52) "/home/koguma/lamp/php-5.0.3/ext/dom/tests/dom003.php" ["line"]=> int(8) ["function"]=> string(11) "appendChild" ["class"]=> string(10) "DOMElement" ["type"]=> string(2) "->" ["args"]=> array(1) { [0]=> object(DOMElement)#2 (0) { } } } } ["code"]=> int(3) } --- Don't catch exception with try/catch Fatal error: Uncaught exception 'DOMException' with message 'Hierarchy Request Error' in /home/koguma/lamp/php-5.0.3/ext/dom/tests/dom003.php:13 Stack trace: #0 /home/koguma/lamp/php-5.0.3/ext/dom/tests/dom003.php(13): DOMElement->appendChild(Object(DOMElement)) #1 {main} thrown in /home/koguma/lamp/php-5.0.3/ext/dom/tests/dom003.php on line 13 ---- FAILED ================================================================================ 012+ array(1) { 013+ [0]=> 014+ array(6) { 015+ ["file"]=> 016+ string(52) "/home/koguma/lamp/php-5.0.3/ext/dom/tests/dom003.php" 017+ ["line"]=> 018+ int(8) 019+ ["function"]=> 020+ string(11) "appendChild" 021+ ["class"]=> 022+ string(10) "DOMElement" 012- array(0) { 013- } 014- ["code"]=> 015- int(3) 016- } 017- --- Don't catch exception with try/catch 018- 019- Fatal error: Uncaught exception 'DOMException' with message 'Hierarchy Request Error' in %sdom003.php:%d 020- Stack trace: 021- #0 {main} 022- thrown in %sdom003.php on line %d 023+ ["type"]=> 024+ string(2) "->" 025+ ["args"]=> 026+ array(1) { 027+ [0]=> 028+ object(DOMElement)#2 (0) { 029+ } 030+ } 031+ } 032+ } 033+ ["code"]=> 034+ int(3) 035+ } 036+ --- Don't catch exception with try/catch 037+ 038+ Fatal error: Uncaught exception 'DOMException' with message 'Hierarchy Request Error' in /home/koguma/lamp/php-5.0.3/ext/dom/tests/dom003.php:13 039+ Stack trace: 040+ #0 /home/koguma/lamp/php-5.0.3/ext/dom/tests/dom003.php(13): DOMElement->appendChild(Object(DOMElement)) 041+ #1 {main} 042+ thrown in /home/koguma/lamp/php-5.0.3/ext/dom/tests/dom003.php on line 13 ================================================================================ ================================================================================ /home/koguma/lamp/php-5.0.3/ext/dom/tests/dom004.phpt ================================================================================ ---- EXPECTED OUTPUT <?xml version="1.0"?> <books> <book> <title>The Grapes of Wrath</title> <author>John Steinbeck</author> </book> <book> <title>The Pearl</title> <author>John Steinbeck</author> </book> </books> ---- ACTUAL OUTPUT Warning: DOMDocument::load(/etc/xml/catalog): failed to open stream: No such file or directory in /home/koguma/lamp/php-5.0.3/ext/dom/tests/dom004.php on line 3 <?xml version="1.0"?> <books> <book> <title>The Grapes of Wrath</title> <author>John Steinbeck</author> </book> <book> <title>The Pearl</title> <author>John Steinbeck</author> </book> </books> ---- FAILED ================================================================================ 001+ Warning: DOMDocument::load(/etc/xml/catalog): failed to open stream: No such file or directory in /home/koguma/lamp/php-5.0.3/ext/dom/tests/dom004.php on line 3 ================================================================================ ================================================================================ /home/koguma/lamp/php-5.0.3/ext/dom/tests/dom_xinclude.phpt ================================================================================ ---- EXPECTED OUTPUT <?xml version="1.0"?> <foo xmlns:xi="http://www.w3.org/2001/XInclude"> <book xml:base="compress.zlib://ext/dom/tests/book.xml"> <title>The Grapes of Wrath</title> <author>John Steinbeck</author> </book><book xml:base="compress.zlib://ext/dom/tests/book.xml"> <title>The Pearl</title> <author>John Steinbeck</author> </book> </foo> #text book book #text ---- ACTUAL OUTPUT Warning: DOMDocument::xinclude(/etc/xml/catalog): failed to open stream: No such file or directory in /home/koguma/lamp/php-5.0.3/ext/dom/tests/dom_xinclude.php on line 4 <?xml version="1.0"?> <foo xmlns:xi="http://www.w3.org/2001/XInclude"> <book xml:base="compress.zlib://ext/dom/tests/book.xml"> <title>The Grapes of Wrath</title> <author>John Steinbeck</author> </book><book xml:base="compress.zlib://ext/dom/tests/book.xml"> <title>The Pearl</title> <author>John Steinbeck</author> </book> </foo> #text book book #text ---- FAILED ================================================================================ 001+ Warning: DOMDocument::xinclude(/etc/xml/catalog): failed to open stream: No such file or directory in /home/koguma/lamp/php-5.0.3/ext/dom/tests/dom_xinclude.php on line 4 ================================================================================ ================================================================================ /home/koguma/lamp/php-5.0.3/ext/iconv/tests/bug16069.phpt ================================================================================ ---- EXPECTED OUTPUT ¥ß¥ê¥Ð¡¼¥ë¥ß¥ê¥Ð¡¼¥ë¥ß¥ê¥Ð¡¼¥ë¥ß¥ê¥Ð¡¼¥ë¥ß¥ê¥Ð¡¼¥ë¥ß¥ê¥Ð¡¼¥ë¥ß¥ê¥Ð¡¼¥ë¥ß¥ê¥Ð¡¼¥ë¥ß¥ê¥Ð¡¼¥ë¥ß¥ê¥Ð¡¼¥ë¥ß¥ê¥Ð¡¼¥ë¥ß¥ê¥Ð¡¼¥ë¥ß¥ê¥Ð¡¼¥ë¥ß¥ê¥Ð¡¼¥ë¥ß¥ê¥Ð¡¼¥ë¥ß¥ê¥Ð¡¼¥ë¥ß¥ê¥Ð¡¼¥ë¥ß¥ê¥Ð¡¼¥ë¥ß¥ê¥Ð¡¼¥ë¥ß¥ê¥Ð¡¼¥ë¥ß¥ê¥Ð¡¼¥ë¥ß¥ê¥Ð¡¼¥ë¥ß¥ê¥Ð¡¼¥ë¥ß¥ê¥Ð¡¼¥ë¥ß¥ê¥Ð¡¼¥ë¥ß¥ê¥Ð¡¼¥ë¥ß¥ê¥Ð¡¼¥ë¥ß¥ê¥Ð¡¼¥ë¥ß¥ê¥Ð¡¼¥ë¥ß¥ê¥Ð¡¼¥ë¥ß¥ê¥Ð¡¼¥ë¥ß¥ê¥Ð¡¼¥ë¥ß¥ê¥Ð¡¼¥ë¥ß¥ê¥Ð¡¼¥ë¥ß¥ê¥Ð¡¼¥ë¥ß¥ê¥Ð¡¼¥ë¥ß¥ê¥Ð¡¼¥ë¥ß¥ê¥Ð¡¼¥ë¥ß¥ê¥Ð¡¼¥ë¥ß¥ê¥Ð¡¼¥ë(¡ë§¥¡ë) ---- ACTUAL OUTPUT ¥ß¥ê¥Ð¡¼¥ë¥ß¥ê¥Ð¡¼¥ë¥ß¥ê¥Ð¡¼¥ë¥ß¥ê¥Ð¡¼¥ë¥ß¥ê¥Ð¡¼¥ë¥ß¥ê¥Ð¡¼¥ë¥ß¥ê¥Ð¡¼¥ë¥ß¥ê¥Ð¡¼¥ë¥ß¥ê¥Ð¡¼¥ë¥ß¥ê¥Ð¡¼¥ë¥ß¥ê¥Ð¡¼¥ë¥ß¥ß¥ê¥Ð¡¼¥ë¥ß¥ê¥Ð¡¼¥ë¥ß¥ê¥Ð¡¼¥ë¥ß¥ê¥Ð¡¼¥ë¥ß¥ê¥Ð¡¼¥ë¥ß¥ê¥Ð¡¼¥ë¥ß¥ê¥Ð¡¼¥ë¥ß¥ê¥Ð¡¼¥ë¥ß¥ê¥Ð¡¼¥ë¥ß¥ê¥Ð¡¼¥ë¥ß¥ê¥Ð¡¼¥ë¥ß¥ê¥Ð¡¼¥ë¥ß¥ê¥Ð¡¼¥ë¥ß¥ê¥Ð¡¼¥ë¥ß¥ê¥Ð¡¼¥ë¥ß¥ê¥Ð¡¼¥ë¥ß¥ê¥Ð¡¼¥ë¥ß¥ê¥Ð¡¼¥ë¥ß¥ê¥Ð¡¼¥ë¥ß¥ê¥Ð¡¼¥ë¥ß¥ê¥Ð¡¼¥ë¥ß¥ê¥Ð¡¼¥ë¥ß¥ê¥Ð¡¼¥ë¥ß¥ê¥Ð¡¼¥ë¥ß¥ê¥Ð¡¼¥ë¥ß¥ê¥Ð¡¼¥ë¥ß¥ê¥Ð¡¼¥ë¥ß¥ê¥Ð¡¼¥ë¥ß¥ê¥Ð¡¼¥ë(¡ë§¥¡ë) ---- FAILED ================================================================================ 001+ ¥ß¥ê¥Ð¡¼¥ë¥ß¥ê¥Ð¡¼¥ë¥ß¥ê¥Ð¡¼¥ë¥ß¥ê¥Ð¡¼¥ë¥ß¥ê¥Ð¡¼¥ë¥ß¥ê¥Ð¡¼¥ë¥ß¥ê¥Ð¡¼¥ë¥ß¥ê¥Ð¡¼¥ë¥ß¥ê¥Ð¡¼¥ë¥ß¥ê¥Ð¡¼¥ë¥ß¥ê¥Ð¡¼¥ë¥ß¥ß¥ê¥Ð¡¼¥ë¥ß¥ê¥Ð¡¼¥ë¥ß¥ê¥Ð¡¼¥ë¥ß¥ê¥Ð¡¼¥ë¥ß¥ê¥Ð¡¼¥ë¥ß¥ê¥Ð¡¼¥ë¥ß¥ê¥Ð¡¼¥ë¥ß¥ê¥Ð¡¼¥ë¥ß¥ê¥Ð¡¼¥ë¥ß¥ê¥Ð¡¼¥ë¥ß¥ê¥Ð¡¼¥ë¥ß¥ê¥Ð¡¼¥ë¥ß¥ê¥Ð¡¼¥ë¥ß¥ê¥Ð¡¼¥ë¥ß¥ê¥Ð¡¼¥ë¥ß¥ê¥Ð¡¼¥ë¥ß¥ê¥Ð¡¼¥ë¥ß¥ê¥Ð¡¼¥ë¥ß¥ê¥Ð¡¼¥ë¥ß¥ê¥Ð¡¼¥ë¥ß¥ê¥Ð¡¼¥ë¥ß¥ê¥Ð¡¼¥ë¥ß¥ê¥Ð¡¼¥ë¥ß¥ê¥Ð¡¼¥ë¥ß¥ê¥Ð¡¼¥ë¥ß¥ê¥Ð¡¼¥ë¥ß¥ê¥Ð¡¼¥ë¥ß¥ê¥Ð¡¼¥ë¥ß¥ê¥Ð¡¼¥ë(¡ë§¥¡ë) 001- ¥ß¥ê¥Ð¡¼¥ë¥ß¥ê¥Ð¡¼¥ë¥ß¥ê¥Ð¡¼¥ë¥ß¥ê¥Ð¡¼¥ë¥ß¥ê¥Ð¡¼¥ë¥ß¥ê¥Ð¡¼¥ë¥ß¥ê¥Ð¡¼¥ë¥ß¥ê¥Ð¡¼¥ë¥ß¥ê¥Ð¡¼¥ë¥ß¥ê¥Ð¡¼¥ë¥ß¥ê¥Ð¡¼¥ë¥ß¥ê¥Ð¡¼¥ë¥ß¥ê¥Ð¡¼¥ë¥ß¥ê¥Ð¡¼¥ë¥ß¥ê¥Ð¡¼¥ë¥ß¥ê¥Ð¡¼¥ë¥ß¥ê¥Ð¡¼¥ë¥ß¥ê¥Ð¡¼¥ë¥ß¥ê¥Ð¡¼¥ë¥ß¥ê¥Ð¡¼¥ë¥ß¥ê¥Ð¡¼¥ë¥ß¥ê¥Ð¡¼¥ë¥ß¥ê¥Ð¡¼¥ë¥ß¥ê¥Ð¡¼¥ë¥ß¥ê¥Ð¡¼¥ë¥ß¥ê¥Ð¡¼¥ë¥ß¥ê¥Ð¡¼¥ë¥ß¥ê¥Ð¡¼¥ë¥ß¥ê¥Ð¡¼¥ë¥ß¥ê¥Ð¡¼¥ë¥ß¥ê¥Ð¡¼¥ë¥ß¥ê¥Ð¡¼¥ë¥ß¥ê¥Ð¡¼¥ë¥ß¥ê¥Ð¡¼¥ë¥ß¥ê¥Ð¡¼¥ë¥ß¥ê¥Ð¡¼¥ë¥ß¥ê¥Ð¡¼¥ë¥ß¥ê¥Ð¡¼¥ë¥ß¥ê¥Ð¡¼¥ë¥ß¥ê¥Ð¡¼¥ë(¡ë§¥¡ë) ================================================================================ ================================================================================ /home/koguma/lamp/php-5.0.3/ext/iconv/tests/iconv_stream_filter.phpt ================================================================================ ---- EXPECTED OUTPUT string(20) "1b244224332473244b24" string(10) "41244f1b28" string(2) "42" string(20) "a4b3a4f3a4cba4c1a4cf" string(10) "69636f6e76" string(2) "0a" Warning: fread(): iconv stream filter ("ISO-2022-JP"=>"EUC-JP"): invalid multibyte sequence in %s on line %d string(0) "" string(0) "" string(0) "" ---- ACTUAL OUTPUT string(20) "1b244224332473244b24" string(10) "41244f1b28" string(2) "42" string(20) "a4b3a4f3a4cba4c1a4cf" string(10) "69636f6e76" string(2) "0a" string(20) "1b244f24332466245824" string(10) "4e24421b28" string(2) "4f" ---- FAILED ================================================================================ 007+ string(20) "1b244f24332466245824" 008+ string(10) "4e24421b28" 009+ string(2) "4f" 007- 008- Warning: fread(): iconv stream filter ("ISO-2022-JP"=>"EUC-JP"): invalid multibyte sequence in %s on line %d 009- string(0) "" 010- string(0) "" 011- string(0) "" ================================================================================ ================================================================================ /home/koguma/lamp/php-5.0.3/ext/standard/tests/array/bug29992.phpt ================================================================================ ---- EXPECTED OUTPUT Array ( [0] => 1 [1] => 2 [2] => 3 ) int(1) int(2) int(3) int(1) int(2) int(3) int(1) int(2) int(3) int(1) int(2) int(3) Array ( [0] => 1 [1] => 2 [2] => 3 ) ===DONE=== ---- ACTUAL OUTPUT Array ( [0] => 1 [1] => 2 [2] => 3 ) int(1) int(2) int(3) int(1) int(2) int(3) int(1) int(2) int(3) int(1) int(2) int(2) Array ( [0] => 1 [1] => 2 [2] => 2 ) ===DONE=== ---- FAILED ================================================================================ 018+ int(2) 018- int(3) 023+ [2] => 2 023- [2] => 3 ================================================================================ ================================================================================ /home/koguma/lamp/php-5.0.3/ext/standard/tests/file/fopencookie.phpt ================================================================================ ---- EXPECTED OUTPUT If you can read this, it worked ---- ACTUAL OUTPUT ---- FAILED ================================================================================ 001+ 001- If you can read this, it worked ================================================================================ ================================================================================ /home/koguma/lamp/php-5.0.3/ext/standard/tests/math/bug24142.phpt ================================================================================ ---- EXPECTED OUTPUT round(0.005, 2) -> 0.01 round(0.015, 2) -> 0.02 round(0.025, 2) -> 0.03 round(0.035, 2) -> 0.04 round(0.045, 2) -> 0.05 round(0.055, 2) -> 0.06 round(0.065, 2) -> 0.07 round(0.075, 2) -> 0.08 round(0.085, 2) -> 0.09 ---- ACTUAL OUTPUT round(0.005, 2) -> 0.01 round(0.015, 2) -> 0.01 round(0.025, 2) -> 0.03 round(0.035, 2) -> 0.04 round(0.045, 2) -> 0.05 round(0.055, 2) -> 0.06 round(0.065, 2) -> 0.07 round(0.075, 2) -> 0.07 round(0.085, 2) -> 0.08 ---- FAILED ================================================================================ 002+ round(0.015, 2) -> 0.01 002- round(0.015, 2) -> 0.02 008+ round(0.075, 2) -> 0.07 009+ round(0.085, 2) -> 0.08 008- round(0.075, 2) -> 0.08 009- round(0.085, 2) -> 0.09 ================================================================================ ================================================================================ /home/koguma/lamp/php-5.0.3/ext/standard/tests/math/bug25694.phpt ================================================================================ ---- EXPECTED OUTPUT round 0.045 = 0.05 number format 0.045 = 0.05 round 0.055 = 0.06 number format 0.055 = 0.06 round 5.045 = 5.05 number format 5.045 = 5.05 round 5.055 = 5.06 number format 5.055 = 5.06 round 3.025 = 3.03 number format 3.025 = 3.03 round 4.025 = 4.03 number format 4.025 = 4.03 ---- ACTUAL OUTPUT round 0.045 = 0.04 number format 0.045 = 0.04 round 0.055 = 0.06 number format 0.055 = 0.06 round 5.045 = 5.04 number format 5.045 = 5.04 round 5.055 = 5.05 number format 5.055 = 5.05 round 3.025 = 3.02 number format 3.025 = 3.02 round 4.025 = 4.03 number format 4.025 = 4.03 ---- FAILED ================================================================================ 001+ round 0.045 = 0.04 002+ number format 0.045 = 0.04 001- round 0.045 = 0.05 002- number format 0.045 = 0.05 007+ round 5.045 = 5.04 008+ number format 5.045 = 5.04 009+ 010+ round 5.055 = 5.05 011+ number format 5.055 = 5.05 012+ 013+ round 3.025 = 3.02 014+ number format 3.025 = 3.02 007- round 5.045 = 5.05 008- number format 5.045 = 5.05 010- round 5.055 = 5.06 011- number format 5.055 = 5.06 012- 013- round 3.025 = 3.03 014- number format 3.025 = 3.03 015- ================================================================================ ================================================================================ /home/koguma/lamp/php-5.0.3/ext/standard/tests/time/bug20382.phpt ================================================================================ ---- EXPECTED OUTPUT tStamp=Wednesday 2004-10-27 17:17:17 CEST result=Monday 2004-11-01 00:00:00 CET wanted=Monday 2004-11-01 00:00:00 CET ---- ACTUAL OUTPUT tStamp=Wednesday 2004-10-27 17:17:17 CEST result=Sunday 2004-10-31 23:00:00 CET wanted=Monday 2004-11-01 00:00:00 CET ---- FAILED ================================================================================ 002+ result=Sunday 2004-10-31 23:00:00 CET 002- result=Monday 2004-11-01 00:00:00 CET ================================================================================ ================================================================================ /home/koguma/lamp/php-5.0.3/ext/wddx/tests/001.phpt ================================================================================ ---- EXPECTED OUTPUT array(11) { ["aNull"]=> NULL ["aString"]=> string(8) "a string" ["aNumber"]=> float(-12.456) ["aDateTime"]=> int(897625932) ["aDateTime2"]=> int(329632332) ["aDateTime3"]=> string(22) "2040-06-12T04:32:12+00" ["aBoolean"]=> bool(true) ["anArray"]=> array(2) { [0]=> int(10) [1]=> string(14) "second element" } ["aBinary"]=> string(11) "binary data" ["anObject"]=> array(2) { ["s"]=> string(8) "a string" ["n"]=> float(-12.456) } ["aRecordset"]=> array(2) { ["NAME"]=> array(2) { [0]=> string(8) "John Doe" [1]=> string(8) "Jane Doe" } ["AGE"]=> array(2) { [0]=> int(34) [1]=> int(31) } } } ---- ACTUAL OUTPUT array(11) { ["aNull"]=> NULL ["aString"]=> string(8) "a string" ["aNumber"]=> float(-12.456) ["aDateTime"]=> int(897625932) ["aDateTime2"]=> int(329632332) ["aDateTime3"]=> string(19) "2040-06-12T04:32:12" ["aBoolean"]=> bool(true) ["anArray"]=> array(2) { [0]=> int(10) [1]=> string(14) "second element" } ["aBinary"]=> string(11) "binary data" ["anObject"]=> array(2) { ["s"]=> string(8) "a string" ["n"]=> float(-12.456) } ["aRecordset"]=> array(2) { ["NAME"]=> array(2) { [0]=> string(8) "John Doe" [1]=> string(8) "Jane Doe" } ["AGE"]=> array(2) { [0]=> int(34) [1]=> int(31) } } } ---- FAILED ================================================================================ 013+ string(19) "2040-06-12T04:32:12" 013- string(22) "2040-06-12T04:32:12+00" ================================================================================ ================================================================================ /home/koguma/lamp/php-5.0.3/ext/xml/tests/bug26614.phpt ================================================================================ ---- EXPECTED OUTPUT CDATA <DATA> at line 2, col 0 (byte 45) </DATA> at line 9, col 0 (byte 90) Comment <DATA> at line 2, col 0 (byte 45) </DATA> at line 9, col 0 (byte 90) Text <DATA> at line 2, col 0 (byte 45) </DATA> at line 9, col 0 (byte 90) ---- ACTUAL OUTPUT CDATA <DATA> at line 2, col 6 (byte 9) </DATA> at line 9, col 7 (byte 56) Comment <DATA> at line 2, col 6 (byte 9) </DATA> at line 9, col 7 (byte 56) Text <DATA> at line 2, col 6 (byte 9) </DATA> at line 9, col 10 (byte 56) ---- FAILED ================================================================================ 002+ <DATA> at line 2, col 6 (byte 9) 003+ </DATA> at line 9, col 7 (byte 56) 002- <DATA> at line 2, col 0 (byte 45) 003- </DATA> at line 9, col 0 (byte 90) 005+ <DATA> at line 2, col 6 (byte 9) 006+ </DATA> at line 9, col 7 (byte 56) 005- <DATA> at line 2, col 0 (byte 45) 006- </DATA> at line 9, col 0 (byte 90) 008+ <DATA> at line 2, col 6 (byte 9) 009+ </DATA> at line 9, col 10 (byte 56) 008- <DATA> at line 2, col 0 (byte 45) 009- </DATA> at line 9, col 0 (byte 90) ================================================================================ ================================================================================ BUILD ENVIRONMENT ================================================================================ OS: Linux - Linux 226.56.21.72.reverse.layeredtech.com 2.6.10-1.766_FC3 #1 Wed Feb 9 23:06:42 EST 2005 i686 Automake: automake (GNU automake) 1.9.2 Written by Tom Tromey <tromey@redhat.com>. Copyright 2004 Free Software Foundation, Inc. This is free software; see the source for copying conditions. There is NO warranty; not even for MERCHANTABILITY or FITNESS FOR A PARTICULAR PURPOSE. Autoconf: autoconf (GNU Autoconf) 2.59 Written by David J. MacKenzie and Akim Demaille. Copyright (C) 2003 Free Software Foundation, Inc. This is free software; see the source for copying conditions. There is NO warranty; not even for MERCHANTABILITY or FITNESS FOR A PARTICULAR PURPOSE. Bundled Libtool: ltmain.sh (GNU libtool) 1.4.3 (1.922.2.110 2002/10/23 01:39:54) System Libtool: ltmain.sh (GNU libtool) 1.5.6 (1.1220.2.95 2004/04/11 05:50:42) Copyright (C) 2003 Free Software Foundation, Inc. This is free software; see the source for copying conditions. There is NO warranty; not even for MERCHANTABILITY or FITNESS FOR A PARTICULAR PURPOSE. Compiler: Reading specs from /usr/lib/gcc/i386-redhat-linux/3.4.2/specs Configured with: ../configure --prefix=/usr --mandir=/usr/share/man --infodir=/usr/share/info --enable-shared --enable-threads=posix --disable-checking --with-system-zlib --enable-__cxa_atexit --disable-libunwind-exceptions --enable-java-awt=gtk --host=i386-redhat-linux Thread model: posix gcc version 3.4.2 20041017 (Red Hat 3.4.2-6.fc3) Bison: bison (GNU Bison) 1.875c Written by Robert Corbett and Richard Stallman. Copyright (C) 2003 Free Software Foundation, Inc. This is free software; see the source for copying conditions. There is NO warranty; not even for MERCHANTABILITY or FITNESS FOR A PARTICULAR PURPOSE. Libraries: libcrypt.so.1 => /lib/libcrypt.so.1 (0x0076d000) libm.so.6 => /lib/tls/libm.so.6 (0x00726000) libdb-4.2.so => /lib/tls/i686/libdb-4.2.so (0x007b1000) libz.so.1 => /usr/lib/libz.so.1 (0x0074b000) libresolv.so.2 => /lib/libresolv.so.2 (0x00111000) libdl.so.2 => /lib/libdl.so.2 (0x00720000) libnsl.so.1 => /lib/libnsl.so.1 (0x00125000) libssl.so.4 => /lib/libssl.so.4 (0x009f4000) libcrypto.so.4 => /lib/libcrypto.so.4 (0x0013b000) libgssapi_krb5.so.2 => /usr/lib/libgssapi_krb5.so.2 (0x00961000) libkrb5.so.3 => /usr/lib/libkrb5.so.3 (0x008d7000) libcom_err.so.2 => /lib/libcom_err.so.2 (0x00223000) libk5crypto.so.3 => /usr/lib/libk5crypto.so.3 (0x0093e000) libxml2.so.2 => /usr/lib/libxml2.so.2 (0x00b5b000) libpthread.so.0 => /lib/tls/libpthread.so.0 (0x0079d000) libc.so.6 => /lib/tls/libc.so.6 (0x005f4000) /lib/ld-linux.so.2 (0x005db000) User's E-mail: AlexeyZilber at gmail dot com ================================================================================ PHPINFO ================================================================================ phpinfo() Hardened-PHP Version => 5.0.3/0.2.6 System => Linux 226.56.21.72.reverse.layeredtech.com 2.6.10-1.766_FC3 #1 Wed Feb 9 23:06:42 EST 2005 i686 Build Date => Feb 17 2005 21:48:29 Configure Command => './configure' '--with-apxs2=/opt/apache/bin/apxs' '--with-config-file-path=/etc/php5-worker' '--with-openssl' '--with-zlib' '--enable-calendar' '--with-curl=shared' '--with-db4=shared' '--enable-ftp=shared' '--with-gd=shared' '--with-flatfile=shared' '--with-mysqli=shared,/opt/mysql/bin/mysql_config' '--with-mysql-sock=/opt/mysql/mysql.sock' '--enable-sockets' '--enable-soap' '--enable-wddx' '--enable-ypa' '--enable-sqlite-utf8' '--enable-sysvshm' '--enable-sysvsem' '--disable-debug' '--enable-sysvmsg' '--with-imagick=shared' '--enable-shmop' '--with-xsl=shared' '--with-xmlrpc=shared' '--with-expat=shared' '--prefix=/opt/php5-worker' '--with-ming=shared,/opt/ming' '--with-mysql=shared,/opt/mysql' '--with-tidy=shared' '--with-pspell=shared' '--with-ffmpeg=shared' '--enable-exif=shared' '--with-jpeg-dir=/usr/lib' '--with-png-dir=/usr/lib' '--enable-eaccelerator=shared' '--with-tsrm-pthreads' Server API => Command Line Interface Virtual Directory Support => enabled Configuration File (php.ini) Path => /etc/php5-worker/php.ini PHP API => 20031224 PHP Extension => 1020041030 Zend Extension => 1220040412 Debug Build => no Thread Safety => enabled IPv6 Support => enabled Registered PHP Streams => php, file, http, ftp, compress.zlib, https, ftps Registered Stream Socket Transports => tcp, udp, unix, udg, ssl, sslv3, sslv2, tls This program makes use of the Zend Scripting Language Engine: Zend Engine v2.0.3, Copyright (c) 1998-2004 Zend Technologies _______________________________________________________________________ Configuration PHP Core Directive => Local Value => Master Value allow_call_time_pass_reference => Off => Off allow_url_fopen => On => On always_populate_raw_post_data => Off => Off arg_separator.input => & => & arg_separator.output => & => & asp_tags => Off => Off auto_append_file => no value => no value auto_globals_jit => On => On auto_prepend_file => no value => no value browscap => no value => no value default_charset => no value => no value default_mimetype => text/html => text/html define_syslog_variables => Off => Off disable_classes => no value => no value disable_functions => no value => no value display_errors => Off => Off display_startup_errors => Off => Off doc_root => no value => no value docref_ext => no value => no value docref_root => no value => no value enable_dl => On => On error_append_string => no value => no value error_log => no value => no value error_prepend_string => no value => no value error_reporting => 2047 => 2047 expose_php => On => On extension_dir => ./ => ./ file_uploads => On => On highlight.bg => #FFFFFF => #FFFFFF highlight.comment => #FF8000 => #FF8000 highlight.default => #0000BB => #0000BB highlight.html => #000000 => #000000 highlight.keyword => #007700 => #007700 highlight.string => #DD0000 => #DD0000 html_errors => Off => On ignore_repeated_errors => Off => Off ignore_repeated_source => Off => Off ignore_user_abort => Off => Off implicit_flush => On => Off include_path => .:/opt/php5-worker/lib/php => .:/opt/php5-worker/lib/php log_errors => On => On log_errors_max_len => 1024 => 1024 magic_quotes_gpc => Off => Off magic_quotes_runtime => Off => Off magic_quotes_sybase => Off => Off mail.force_extra_parameters => no value => no value max_execution_time => 0 => 30 max_input_time => 60 => 60 open_basedir => no value => no value output_buffering => 0 => 4096 output_handler => no value => no value post_max_size => 8M => 8M precision => 14 => 14 register_argc_argv => On => Off register_globals => Off => Off register_long_arrays => Off => Off report_memleaks => On => On report_zend_debug => Off => Off safe_mode => Off => Off safe_mode_exec_dir => no value => no value safe_mode_gid => Off => Off safe_mode_include_dir => no value => no value sendmail_from => no value => no value sendmail_path => /usr/sbin/sendmail -t -i => /usr/sbin/sendmail -t -i serialize_precision => 100 => 100 short_open_tag => On => On SMTP => localhost => localhost smtp_port => 25 => 25 sql.safe_mode => Off => Off track_errors => Off => Off unserialize_callback_func => no value => no value upload_max_filesize => 2M => 2M upload_tmp_dir => no value => no value user_dir => no value => no value variables_order => GPCS => GPCS xmlrpc_error_number => 0 => 0 xmlrpc_errors => Off => Off y2k_compliance => On => On zend.ze1_compatibility_mode => Off => Off calendar Calendar support => enabled ctype ctype functions => enabled dba DBA support => enabled Supported handlers => cdb cdb_make db4 inifile flatfile dom DOM/XML => enabled DOM/XML API Version => 20031129 libxml Version => 2.6.16 HTML Support => enabled XPath Support => enabled XPointer Support => enabled Schema Support => enabled RelaxNG Support => enabled iconv iconv support => enabled iconv implementation => glibc iconv library version => 2.3.4 Directive => Local Value => Master Value iconv.input_encoding => ISO-8859-1 => ISO-8859-1 iconv.internal_encoding => ISO-8859-1 => ISO-8859-1 iconv.output_encoding => ISO-8859-1 => ISO-8859-1 libxml libXML support => active libXML Version => 2.6.16 libXML streams => enabled openssl OpenSSL support => enabled OpenSSL Version => OpenSSL 0.9.7a Feb 19 2003 pcre PCRE (Perl Compatible Regular Expressions) Support => enabled PCRE Library Version => 4.5 01-December-2003 posix Revision => $Revision: 1.60 $ session Session Support => enabled Registered save handlers => files user sqlite Registered serializer handlers => php php_binary wddx Directive => Local Value => Master Value session.auto_start => Off => Off session.bug_compat_42 => Off => Off session.bug_compat_warn => On => On session.cache_expire => 180 => 180 session.cache_limiter => nocache => nocache session.cookie_domain => no value => no value session.cookie_lifetime => 0 => 0 session.cookie_path => / => / session.cookie_secure => Off => Off session.entropy_file => no value => no value session.entropy_length => 0 => 0 session.gc_divisor => 1000 => 1000 session.gc_maxlifetime => 1440 => 1440 session.gc_probability => 1 => 1 session.hash_bits_per_character => 5 => 5 session.hash_function => 0 => 0 session.name => PHPSESSID => PHPSESSID session.referer_check => no value => no value session.save_handler => files => files session.save_path => no value => no value session.serialize_handler => php => php session.use_cookies => On => On session.use_only_cookies => Off => Off session.use_trans_sid => 0 => 0 shmop shmop support => enabled SimpleXML Simplexml support => enabled Revision => $Revision: 1.139.2.4 $ Schema support => enabled soap Soap Client => enabled Soap Server => enabled Directive => Local Value => Master Value soap.wsdl_cache_dir => /tmp => /tmp soap.wsdl_cache_enabled => 1 => 1 soap.wsdl_cache_ttl => 86400 => 86400 sockets Sockets Support => enabled SPL SPL support => enabled Interfaces => RecursiveIterator, SeekableIterator Classes => ArrayObject, ArrayIterator, CachingIterator, CachingRecursiveIterator, DirectoryIterator, FilterIterator, LimitIterator, ParentIterator, RecursiveDirectoryIterator, RecursiveIteratorIterator, SimpleXMLIterator SQLite SQLite support => enabled PECL Module version => 2.0-dev $Id: sqlite.c,v 1.146.2.3 2004/09/26 01:41:40 wez Exp $ SQLite Library => 2.8.14 SQLite Encoding => UTF-8 Directive => Local Value => Master Value sqlite.assoc_case => 0 => 0 standard Regex Library => Bundled library enabled Dynamic Library Support => enabled Path to sendmail => /usr/sbin/sendmail -t -i Directive => Local Value => Master Value assert.active => 1 => 1 assert.bail => 0 => 0 assert.callback => no value => no value assert.quiet_eval => 0 => 0 assert.warning => 1 => 1 auto_detect_line_endings => 0 => 0 date.default_latitude => 31.7667 => 31.7667 date.default_longitude => 35.2333 => 35.2333 date.sunrise_zenith => 90.83 => 90.83 date.sunset_zenith => 90.83 => 90.83 default_socket_timeout => 60 => 60 safe_mode_allowed_env_vars => PHP_ => PHP_ safe_mode_protected_env_vars => LD_LIBRARY_PATH => LD_LIBRARY_PATH url_rewriter.tags => a=href,area=href,frame=src,input=src,form=fakeentry => a=href,area=href,frame=src,input=src,form=fakeentry user_agent => no value => no value sysvmsg sysvmsg support => enabled Revision => $Revision: 1.16 $ tokenizer Tokenizer Support => enabled varfilter Hardened-PHP's variable filter support => enabled Directive => Local Value => Master Value varfilter.max_array_depth => 100 => 100 varfilter.max_request_variables => 200 => 200 varfilter.max_value_length => 10000 => 10000 varfilter.max_varname_length => 64 => 64 wddx WDDX Support => enabled WDDX Session Serializer => enabled xml XML Support => active XML Namespace Support => active libxml2 Version => 2.6.16 zlib ZLib Support => enabled Compiled Version => 1.2.1.2 Linked Version => 1.2.1.2 Directive => Local Value => Master Value zlib.output_compression => Off => Off zlib.output_compression_level => -1 => -1 zlib.output_handler => no value => no value Additional Modules Module Name sysvsem sysvshm Environment Variable => Value LDFLAGS => -L/opt/mysql/lib/mysql HOSTNAME => 226.56.21.72.reverse.layeredtech.com TEST_PHP_SRCDIR => /home/koguma/lamp/php-5.0.3 SHELL => /bin/sh TERM => screen MAKEFLAGS => HISTSIZE => 1000 SSH_CLIENT => deleted OLDPWD => /home/koguma/lamp/php-5.0.3 SSH_TTY => deleted USER => ltsv-2301 LS_COLORS => no=00:fi=00:di=01;34:ln=01;36:pi=40;33:so=01;35:bd=40;33;01:cd=40;33;01:or=01;05;37;41:mi=01;05;37;41:ex=01;32:*.cmd=01;32:*.exe=01;32:*.com=01;32:*.btm=01;32:*.bat=01;32:*.sh=01;32:*.csh=01;32:*.tar=01;31:*.tgz=01;31:*.arj=01;31:*.taz=01;31:*.lzh=01;31:*.zip=01;31:*.z=01;31:*.Z=01;31:*.gz=01;31:*.bz2=01;31:*.bz=01;31:*.tz=01;31:*.rpm=01;31:*.cpio=01;31:*.jpg=01;35:*.gif=01;35:*.bmp=01;35:*.xbm=01;35:*.xpm=01;35:*.png=01;35:*.tif=01;35: SCRIPT_FILENAME => SSH_AUTH_SOCK => deleted TERMCAP => SC|screen|VT 100/ANSI X3.64 virtual terminal:\ :DO=\E[%dB:LE=\E[%dD:RI=\E[%dC:UP=\E[%dA:bs:bt=\E[Z:\ :cd=\E[J:ce=\E[K:cl=\E[H\E[J:cm=\E[%i%d;%dH:ct=\E[3g:\ :do=^J:nd=\E[C:pt:rc=\E8:rs=\Ec:sc=\E7:st=\EH:up=\EM:\ :le=^H:bl=^G:cr=^M:it#8:ho=\E[H:nw=\EE:ta=^I:is=\E)0:\ :li#59:co#132:am:xn:xv:LP:sr=\EM:al=\E[L:AL=\E[%dL:\ :cs=\E[%i%d;%dr:dl=\E[M:DL=\E[%dM:ks=\E[?1h\E=:\ :ke=\E[?1l\E>:vi=\E[?25l:ve=\E[34h\E[?25h:vs=\E[34l:\ :ti=\E[?1049h:te=\E[?1049l:us=\E[4m:ue=\E[24m:so=\E[3m:\ :se=\E[23m:mb=\E[5m:md=\E[1m:mr=\E[7m:me=\E[m:ms:\ :Co#8:pa#64:AF=\E[3%dm:AB=\E[4%dm:op=\E[39;49m:AX:G0:\ :as=\E(0:ae=\E(B:\ :ac=\140\140aaffggjjkkllmmnnooppqqrrssttuuvvwwxxyyzz{{||}}~~..--++,,hhII00:\ :k0=\E[10~:k1=\EOP:k2=\EOQ:k3=\EOR:k4=\EOS:k5=\E[15~:\ :k6=\E[17~:k7=\E[18~:k8=\E[19~:k9=\E[20~:k;=\E[21~:\ :F1=\E[23~:F2=\E[24~:kb=^H:K1=\EOq:K2=\EOr:K3=\EOs:\ :K4=\EOp:K5=\EOn:kh=\E[1~:@1=\E[1~:kH=\E[4~:@7=\E[4~:\ :kN=\E[6~:kP=\E[5~:kI=\E[2~:kD=\E[3~:ku=\EOA:kd=\EOB:\ :kr=\EOC:kl=\EOD: MAKELEVEL => 1 MFLAGS => PATH => /usr/kerberos/sbin:/usr/kerberos/bin:/usr/local/bin:/bin:/usr/bin:/usr/X11R6/bin:/home/ltsv-2301/bin MAIL => /var/spool/mail/ltsv-2301 STY => 3823.pts-0.226 PWD => /home/koguma/lamp/php-5.0.3 INPUTRC => /etc/inputrc LANG => en_US.UTF-8 TEST_PHP_EXECUTABLE => /home/koguma/lamp/php-5.0.3/sapi/cli/php REDIRECT_STATUS => PATH_TRANSLATED => HOME => /root SHLVL => 5 CONTENT_LENGTH => CFLAGS => -O3 -DDBUG_OFF -msse2 -msse -mmmx -mcpu=pentium4 -minline-all-stringops -DMM_SHM_IPC -DMM_SEM_IPC -pthread -DZTS -prefer-pic LOGNAME => ltsv-2301 QUERY_STRING => WINDOW => 0 SSH_CONNECTION => ::ffff:219.95.218.120 50952 ::ffff:72.21.56.226 22 LESSOPEN => |/usr/bin/lesspipe.sh %s CONTENT_TYPE => DISPLAY => localhost:10.0 CC => /home/koguma/lamp/php-5.0.3/meta_ccld REQUEST_METHOD => G_BROKEN_FILENAMES => 1 XAUTHORITY => /root/.xauthtwKbpD _ => /home/koguma/lamp/php-5.0.3/sapi/cli/php PHP Variables Variable => Value _SERVER["LDFLAGS"] => -L/opt/mysql/lib/mysql _SERVER["HOSTNAME"] => 226.56.21.72.reverse.layeredtech.com _SERVER["TEST_PHP_SRCDIR"] => /home/koguma/lamp/php-5.0.3 _SERVER["SHELL"] => /bin/sh _SERVER["TERM"] => screen _SERVER["MAKEFLAGS"] => _SERVER["HISTSIZE"] => 1000 _SERVER["SSH_CLIENT"] => deleted _SERVER["OLDPWD"] => /home/koguma/lamp/php-5.0.3 _SERVER["SSH_TTY"] => deleted _SERVER["USER"] => ltsv-2301 _SERVER["LS_COLORS"] => no=00:fi=00:di=01;34:ln=01;36:pi=40;33:so=01;35:bd=40;33;01:cd=40;33;01:or=01;05;37;41:mi=01;05;37;41:ex=01;32:*.cmd=01;32:*.exe=01;32:*.com=01;32:*.btm=01;32:*.bat=01;32:*.sh=01;32:*.csh=01;32:*.tar=01;31:*.tgz=01;31:*.arj=01;31:*.taz=01;31:*.lzh=01;31:*.zip=01;31:*.z=01;31:*.Z=01;31:*.gz=01;31:*.bz2=01;31:*.bz=01;31:*.tz=01;31:*.rpm=01;31:*.cpio=01;31:*.jpg=01;35:*.gif=01;35:*.bmp=01;35:*.xbm=01;35:*.xpm=01;35:*.png=01;35:*.tif=01;35: _SERVER["SCRIPT_FILENAME"] => _SERVER["SSH_AUTH_SOCK"] => deleted _SERVER["TERMCAP"] => SC|screen|VT 100/ANSI X3.64 virtual terminal:\ :DO=\E[%dB:LE=\E[%dD:RI=\E[%dC:UP=\E[%dA:bs:bt=\E[Z:\ :cd=\E[J:ce=\E[K:cl=\E[H\E[J:cm=\E[%i%d;%dH:ct=\E[3g:\ :do=^J:nd=\E[C:pt:rc=\E8:rs=\Ec:sc=\E7:st=\EH:up=\EM:\ :le=^H:bl=^G:cr=^M:it#8:ho=\E[H:nw=\EE:ta=^I:is=\E)0:\ :li#59:co#132:am:xn:xv:LP:sr=\EM:al=\E[L:AL=\E[%dL:\ :cs=\E[%i%d;%dr:dl=\E[M:DL=\E[%dM:ks=\E[?1h\E=:\ :ke=\E[?1l\E>:vi=\E[?25l:ve=\E[34h\E[?25h:vs=\E[34l:\ :ti=\E[?1049h:te=\E[?1049l:us=\E[4m:ue=\E[24m:so=\E[3m:\ :se=\E[23m:mb=\E[5m:md=\E[1m:mr=\E[7m:me=\E[m:ms:\ :Co#8:pa#64:AF=\E[3%dm:AB=\E[4%dm:op=\E[39;49m:AX:G0:\ :as=\E(0:ae=\E(B:\ :ac=\140\140aaffggjjkkllmmnnooppqqrrssttuuvvwwxxyyzz{{||}}~~..--++,,hhII00:\ :k0=\E[10~:k1=\EOP:k2=\EOQ:k3=\EOR:k4=\EOS:k5=\E[15~:\ :k6=\E[17~:k7=\E[18~:k8=\E[19~:k9=\E[20~:k;=\E[21~:\ :F1=\E[23~:F2=\E[24~:kb=^H:K1=\EOq:K2=\EOr:K3=\EOs:\ :K4=\EOp:K5=\EOn:kh=\E[1~:@1=\E[1~:kH=\E[4~:@7=\E[4~:\ :kN=\E[6~:kP=\E[5~:kI=\E[2~:kD=\E[3~:ku=\EOA:kd=\EOB:\ :kr=\EOC:kl=\EOD: _SERVER["MAKELEVEL"] => 1 _SERVER["MFLAGS"] => _SERVER["PATH"] => /usr/kerberos/sbin:/usr/kerberos/bin:/usr/local/bin:/bin:/usr/bin:/usr/X11R6/bin:/home/ltsv-2301/bin _SERVER["MAIL"] => /var/spool/mail/ltsv-2301 _SERVER["STY"] => 3823.pts-0.226 _SERVER["PWD"] => /home/koguma/lamp/php-5.0.3 _SERVER["INPUTRC"] => /etc/inputrc _SERVER["LANG"] => en_US.UTF-8 _SERVER["TEST_PHP_EXECUTABLE"] => /home/koguma/lamp/php-5.0.3/sapi/cli/php _SERVER["REDIRECT_STATUS"] => _SERVER["PATH_TRANSLATED"] => _SERVER["HOME"] => /root _SERVER["SHLVL"] => 5 _SERVER["CONTENT_LENGTH"] => _SERVER["CFLAGS"] => -O3 -DDBUG_OFF -msse2 -msse -mmmx -mcpu=pentium4 -minline-all-stringops -DMM_SHM_IPC -DMM_SEM_IPC -pthread -DZTS -prefer-pic _SERVER["LOGNAME"] => ltsv-2301 _SERVER["QUERY_STRING"] => _SERVER["WINDOW"] => 0 _SERVER["SSH_CONNECTION"] => ::ffff:219.95.218.120 50952 ::ffff:72.21.56.226 22 _SERVER["LESSOPEN"] => |/usr/bin/lesspipe.sh %s _SERVER["CONTENT_TYPE"] => _SERVER["DISPLAY"] => localhost:10.0 _SERVER["CC"] => /home/koguma/lamp/php-5.0.3/meta_ccld _SERVER["REQUEST_METHOD"] => _SERVER["G_BROKEN_FILENAMES"] => 1 _SERVER["XAUTHORITY"] => /root/.xauthtwKbpD _SERVER["_"] => /home/koguma/lamp/php-5.0.3/sapi/cli/php _SERVER["PHP_SELF"] => _SERVER["SCRIPT_NAME"] => _SERVER["DOCUMENT_ROOT"] => _SERVER["argv"] => Array ( ) _SERVER["argc"] => 0 _ENV["LDFLAGS"] => -L/opt/mysql/lib/mysql _ENV["HOSTNAME"] => 226.56.21.72.reverse.layeredtech.com _ENV["TEST_PHP_SRCDIR"] => /home/koguma/lamp/php-5.0.3 _ENV["SHELL"] => /bin/sh _ENV["TERM"] => screen _ENV["MAKEFLAGS"] => _ENV["HISTSIZE"] => 1000 _ENV["SSH_CLIENT"] => deleted _ENV["OLDPWD"] => /home/koguma/lamp/php-5.0.3 _ENV["SSH_TTY"] => deleted _ENV["USER"] => ltsv-2301 _ENV["LS_COLORS"] => no=00:fi=00:di=01;34:ln=01;36:pi=40;33:so=01;35:bd=40;33;01:cd=40;33;01:or=01;05;37;41:mi=01;05;37;41:ex=01;32:*.cmd=01;32:*.exe=01;32:*.com=01;32:*.btm=01;32:*.bat=01;32:*.sh=01;32:*.csh=01;32:*.tar=01;31:*.tgz=01;31:*.arj=01;31:*.taz=01;31:*.lzh=01;31:*.zip=01;31:*.z=01;31:*.Z=01;31:*.gz=01;31:*.bz2=01;31:*.bz=01;31:*.tz=01;31:*.rpm=01;31:*.cpio=01;31:*.jpg=01;35:*.gif=01;35:*.bmp=01;35:*.xbm=01;35:*.xpm=01;35:*.png=01;35:*.tif=01;35: _ENV["SCRIPT_FILENAME"] => _ENV["SSH_AUTH_SOCK"] => deleted _ENV["TERMCAP"] => SC|screen|VT 100/ANSI X3.64 virtual terminal:\ :DO=\E[%dB:LE=\E[%dD:RI=\E[%dC:UP=\E[%dA:bs:bt=\E[Z:\ :cd=\E[J:ce=\E[K:cl=\E[H\E[J:cm=\E[%i%d;%dH:ct=\E[3g:\ :do=^J:nd=\E[C:pt:rc=\E8:rs=\Ec:sc=\E7:st=\EH:up=\EM:\ :le=^H:bl=^G:cr=^M:it#8:ho=\E[H:nw=\EE:ta=^I:is=\E)0:\ :li#59:co#132:am:xn:xv:LP:sr=\EM:al=\E[L:AL=\E[%dL:\ :cs=\E[%i%d;%dr:dl=\E[M:DL=\E[%dM:ks=\E[?1h\E=:\ :ke=\E[?1l\E>:vi=\E[?25l:ve=\E[34h\E[?25h:vs=\E[34l:\ :ti=\E[?1049h:te=\E[?1049l:us=\E[4m:ue=\E[24m:so=\E[3m:\ :se=\E[23m:mb=\E[5m:md=\E[1m:mr=\E[7m:me=\E[m:ms:\ :Co#8:pa#64:AF=\E[3%dm:AB=\E[4%dm:op=\E[39;49m:AX:G0:\ :as=\E(0:ae=\E(B:\ :ac=\140\140aaffggjjkkllmmnnooppqqrrssttuuvvwwxxyyzz{{||}}~~..--++,,hhII00:\ :k0=\E[10~:k1=\EOP:k2=\EOQ:k3=\EOR:k4=\EOS:k5=\E[15~:\ :k6=\E[17~:k7=\E[18~:k8=\E[19~:k9=\E[20~:k;=\E[21~:\ :F1=\E[23~:F2=\E[24~:kb=^H:K1=\EOq:K2=\EOr:K3=\EOs:\ :K4=\EOp:K5=\EOn:kh=\E[1~:@1=\E[1~:kH=\E[4~:@7=\E[4~:\ :kN=\E[6~:kP=\E[5~:kI=\E[2~:kD=\E[3~:ku=\EOA:kd=\EOB:\ :kr=\EOC:kl=\EOD: _ENV["MAKELEVEL"] => 1 _ENV["MFLAGS"] => _ENV["PATH"] => /usr/kerberos/sbin:/usr/kerberos/bin:/usr/local/bin:/bin:/usr/bin:/usr/X11R6/bin:/home/ltsv-2301/bin _ENV["MAIL"] => /var/spool/mail/ltsv-2301 _ENV["STY"] => 3823.pts-0.226 _ENV["PWD"] => /home/koguma/lamp/php-5.0.3 _ENV["INPUTRC"] => /etc/inputrc _ENV["LANG"] => en_US.UTF-8 _ENV["TEST_PHP_EXECUTABLE"] => /home/koguma/lamp/php-5.0.3/sapi/cli/php _ENV["REDIRECT_STATUS"] => _ENV["PATH_TRANSLATED"] => _ENV["HOME"] => /root _ENV["SHLVL"] => 5 _ENV["CONTENT_LENGTH"] => _ENV["CFLAGS"] => -O3 -DDBUG_OFF -msse2 -msse -mmmx -mcpu=pentium4 -minline-all-stringops -DMM_SHM_IPC -DMM_SEM_IPC -pthread -DZTS -prefer-pic _ENV["LOGNAME"] => ltsv-2301 _ENV["QUERY_STRING"] => _ENV["WINDOW"] => 0 _ENV["SSH_CONNECTION"] => ::ffff:219.95.218.120 50952 ::ffff:72.21.56.226 22 _ENV["LESSOPEN"] => |/usr/bin/lesspipe.sh %s _ENV["CONTENT_TYPE"] => _ENV["DISPLAY"] => localhost:10.0 _ENV["CC"] => /home/koguma/lamp/php-5.0.3/meta_ccld _ENV["REQUEST_METHOD"] => _ENV["G_BROKEN_FILENAMES"] => 1 _ENV["XAUTHORITY"] => /root/.xauthtwKbpD _ENV["_"] => /home/koguma/lamp/php-5.0.3/sapi/cli/php PHP License This program is free software; you can redistribute it and/or modify it under the terms of the PHP License as published by the PHP Group and included in the distribution in the file: LICENSE This program is distributed in the hope that it will be useful, but WITHOUT ANY WARRANTY; without even the implied warranty of MERCHANTABILITY or FITNESS FOR A PARTICULAR PURPOSE. If you did not receive a copy of the PHP license, or have any questions about PHP licensing, please contact license@php.net.

« previous php.qa (#23759) next »