PHP Test results
| From: | noreply@php.net | Date: | Sat, 23 Mar 2002 10:00:36 +0000 |
| Subject: | PHP Test results | ||
| Groups: | php.qa | ||
| Request: | Send a blank email to php-qa+get-4624@lists.php.net to get a copy of this message | ||
array (
'user_name' => 'Shane Froebel',
'email' => 'bugs@optonline.net',
'package' => '4.2.0-RC1',
'testcase' => '0',
'status' => 'Good',
'os' => 'Linux i386',
'sapi' => 'Apache 2.x DSO',
'automake' => '14',
'autoconf' => '213',
'libtool' => '140',
'bison' => '128',
'test' => './configure --quiet --with-mysql=no --with-apxs2=/www/bin/apxs --
works
',
'problems' => '\'make\' fails at:
var_unserializer.c: In function `php_var_unserialize\':
var_unserializer.c:300: warning: comparison is always false due to limited range of data type
and the other error:
Making all in sapi
make[1]: Entering directory `/root/php-4.2.0RC1/sapi\'
Making all in apache2filter
make[2]: Entering directory `/root/php-4.2.0RC1/sapi/apache2filter\'
make[3]: Entering directory `/root/php-4.2.0RC1/sapi/apache2filter\'
/bin/sh /root/php-4.2.0RC1/libtool --silent --mode=compile gcc -I.
-I/root/php-4.2.0RC1/sapi/apache2filter -I/root/php-4.2.0RC1/main -I/root/php-4.2.0RC1
-I/www/include -I/root/php-4.2.0RC1/Zend -I/root/php-4.2.0RC1/ext/xml/expat -D_REENTRANT
-I/root/php-4.2.0RC1/TSRM -g -O2 -pthread -DZTS -prefer-pic -c sapi_apache2.c
sapi_apache2.c: In function `php_register_hook\':
sapi_apache2.c:473: `AP_FTYPE_RESOURCE\' undeclared (first use in this function)
sapi_apache2.c:473: (Each undeclared identifier is reported only once
sapi_apache2.c:473: for each function it appears in.)
make[3]: *** [sapi_apache2.lo] Error 1
make[3]: Leaving directory `/root/php-4.2.0RC1/sapi/apache2filter\'
make[2]: *** [all-recursive] Error 1
make[2]: Leaving directory `/root/php-4.2.0RC1/sapi/apache2filter\'
make[1]: *** [all-recursive] Error 1
make[1]: Leaving directory `/root/php-4.2.0RC1/sapi\'
make: *** [all-recursive] Error 1',
'bugids' => '#16229',
'remarks' => 'Hopefully the sapi_apache2.c file gets fix cause this halts the
make process. I have no idea if the other error would have failed the make install. Good luck.
Note: posted this also in bugs.php.net',
)