PHP Test results

From: Date: Sat, 23 Mar 2002 11:40:29 +0000
Subject: PHP Test results
Groups: php.qa 
Request: Send a blank email to php-qa+get-4625@lists.php.net to get a copy of this message
array ( 'user_name' => 'Joerg Behrens', 'email' => 'joerg@php.net', 'package' => '4.2.0-RC1', 'testcase' => '0', 'status' => 'Fail', 'os' => 'Irix', 'sapi' => 'cli', 'automake' => '14', 'autoconf' => '213', 'libtool' => '140', 'bison' => '128', 'sockets' => 'on', 'test' => '', 'problems' => 'sockets.c:34: warning: `__EXTENSIONS__\' redefined *Initialization*:1: warning: this is the location of the previous definition sockets.c: In function `zif_socket_recvmsg\': sockets.c:1472: warning: assignment from incompatible pointer type sockets.c:1477: warning: assignment from incompatible pointer type sockets.c:1479: structure has no member named `msg_flags\' sockets.c:1495: structure has no member named `msg_flags\' sockets.c:1521: warning: assignment from incompatible pointer type sockets.c:1527: warning: assignment from incompatible pointer type sockets.c:1534: structure has no member named `msg_flags\' sockets.c:1550: structure has no member named `msg_flags\' sockets.c: In function `zif_socket_sendmsg\': sockets.c:1607: warning: assignment from incompatible pointer type sockets.c:1635: warning: assignment from incompatible pointer type gmake[3]: *** [sockets.lo] Error 1 gmake[3]: Leaving directory `/usr3/GCC/php-4.2.0RC1/ext/sockets\' gmake[2]: *** [all-recursive] Error 1 gmake[2]: Leaving directory `/usr3/GCC/php-4.2.0RC1/ext/sockets\' gmake[1]: *** [all-recursive] Error 1 gmake[1]: Leaving directory `/usr3/GCC/php-4.2.0RC1/ext\' gmake: *** [all-recursive] Error 1', 'bugids' => '9229', 'remarks' => '#! /bin/sh # # Created by configure CFLAGS=\'-mabi=n32 -mips4 -fno-builtins -I/usr/local/include\' \\ CC=\'gcc\' \\ CXX=\'g++\' \\ \'./configure\' \\ \'--with-config-file-path=/etc\' \\ \'--enable-sockets\' \\ \"$@\" Cant remember that the ext/sockets ever worked under SGI Irix.', )

« previous php.qa (#4625) next »