Results

From: Date: Sat, 23 Mar 2002 21:12:57 +0000
Subject: Results
Groups: php.qa 
Request: Send a blank email to php-qa+get-4649@lists.php.net to get a copy of this message
Since I'm new to this, I would be happy if someone pointed out my misstakes. Thanks in advance. -- My configure line: ./configure --with-apxs=/usr/local/apache/bin/apxs --with-config-file-path=/usr/local/apache/conf --enable-versioning --with-mysql --enable-ftp --with-gd --enable-bcmath --disable-debug --enable-memory-limit=yes --enable-track-vars --with-pdflib --with-ttf --with-imap --with-jpeg-dir=../jpeg-6b --with-png-dir=../libpng-1.2.1 --with-freetype-dir=../freetype-2.0.6 --with-ircg --with-ircg-config=/usr/local/bin/ircg-config --with-ming=../ming-0.2a --with-zlib-dir=../zlib-1.1.3 --enable-mailparse I installed PHP Version: 4.2.0rc1 on Linux 2.4.17, this is the result of 'make test' with comments: TEST RESULT SUMMARY ============================= Number of tests: 270 Tests skipped: 114 ( 42%) Tests failed: 21 ( 13%) Tests passed: 135 ( 87%) ============================= Skipped 0 extensions. PHP Version: 4.2.0rc1 mb_http_input() (003.phpt) ... failed >> This doesn't seem to be worth noticing, the test doesn't even work correctly as far as I can understand. Session Object Serialization (001.phpt) ... failed >> Does work but returns an error about cache limit-stuff and header already sent, not worth noticing. Session Object Deserialization (003.phpt) ... failed >> Same as above, works fine after minor changes. session_set_save_handler test (004.phpt) ... failed >> Same as above, works fine after minor changes. Custom save handler, multiple session_start()s, complex data structu ... failed >> Same as above, works fine after minor changes. References between variables in sessions (006.phpt) ... failed >> Same as above, works fine after minor changes. Test array_walk, arsort, asort, krsort, ksort, rsort and sort (001.p ... failed >> Don't know why this fails. nonexisting back reference (012.phpt) ... failed >> Don't know why this fails either but while trying myself no problem occurs. xml_parse_into_struct/umlauts in tags (007.phpt) ... failed >> Some of the characters tested is shown as small ones, ÄÖÜ becomes äöü in strings and in array keys. I don't know why this is, a known bug? DB_Error/DB_Warning test (db_error.phpt) ... failed >> The linenumber differs, like this: expected: User Notice: DB Error: syntax error in PEAR.php on line 593 file: User Notice: DB Error: syntax error in PEAR.php on line 591 No more then that. DB configurable error handler test (db_error2.phpt) ... failed >> Same as above, line differs. XML Parser: parse from file (002.phpt) ... failed >> When trying myself it does work, can't figure out why it fails. Probably nothing. XML Parser: parse from file resource (003.phpt) ... failed >> Same as above. PEAR_Error: basic test (pear_error.phpt) ... failed >> The linenumber differs (as above) PEAR_Error: default error handling (pear_error3.phpt) ... failed >> Expected: error 1 errorhandler called with an error object. error message: error 3 error 4 Outputted: error 1 errorhandler called with an error object. error message: error 3 errorhandler Dunno what the problem is. OO Bug Test (Bug #7515) (029.phpt) ... failed >> Simply fails, can't say I know why. Have never really been into OOP. Over and out, -jome

« previous php.qa (#4649) next »