PHP Test results

From: Date: Wed, 27 Mar 2002 19:47:07 +0000
Subject: PHP Test results
Groups: php.qa 
Request: Send a blank email to php-qa+get-4777@lists.php.net to get a copy of this message
array ( 'user_name' => 'Melvyn Sopacua', 'email' => 'msopacua@idg.nl', 'package' => '4.2.0-RC1', 'testcase' => '0', 'status' => 'Fail', 'os' => 'other', 'sapi' => 'Apache 1.3.x Static', 'automake' => '15', 'autoconf' => '252', 'libtool' => '140', 'bison' => '130', 'bcmath' => 'on', 'calendar' => 'on', 'ctype' => 'on', 'curl' => 'on', 'domxml' => 'on', 'ftp' => 'on', 'gd' => 'on', 'iconv' => 'on', 'mailparse' => 'on', 'mbstring' => 'on', 'mhash' => 'on', 'mysql' => 'on', 'openssl' => 'on', 'overload' => 'on', 'pcre' => 'on', 'pgsql' => 'on', 'session' => 'on', 'sockets' => 'on', 'standard' => 'on', 'tokenizer' => 'on', 'xml' => 'on', 'xslt' => 'on', 'zip' => 'on', 'test' => '', 'problems' => 'make[3]: Entering directory `/home/mdev/_src/php-4.2.0RC1/ext/sysvsem\' gcc -I. -I/home/mdev/_src/php-4.2.0RC1/ext/sysvsem -I/home/mdev/_src/php-4.2.0RC1/main -I/home/mdev/_src/php-4.2.0RC1 -I/home/mdev/_src /apache_1.3.24/src/include -I/home/mdev/_src/apache_1.3.24/src/os/unix -I/home/mdev/_src/php-4.2.0RC1/Zend -I/weblib/local/include -I/w eblib/local/include/libxml2 -I/weblib/local/include/freetype2/freetype -I/weblib/local/include/mysql -I/pgsql/include -I/home/mdev/_sr c/php-4.2.0RC1/TSRM -g -O2 -c sysvsem.c && touch sysvsem.lo sysvsem.c: In function `zif_sem_remove\': sysvsem.c:414: incompatible type for argument 4 of `semctl\' make[3]: *** [sysvsem.lo] Error 1 make[3]: Leaving directory `/home/mdev/_src/php-4.2.0RC1/ext/sysvsem\' make[2]: *** [all-recursive] Error 1 make[2]: Leaving directory `/home/mdev/_src/php-4.2.0RC1/ext/sysvsem\' make[1]: *** [all-recursive] Error 1 make[1]: Leaving directory `/home/mdev/_src/php-4.2.0RC1/ext\' make: *** [all-recursive] Error 1 ', 'bugids' => '', 'remarks' => 'Might be interesting: var_unserializer.c: In function `php_var_unserialize\': var_unserializer.c:300: warning: comparison is always false due to limited range of data type Unrelated to compile failure though OS: BSDI 4.2 To-be-continued :-)', )

« previous php.qa (#4777) next »