Re: PHP Test results

From: Date: Thu, 28 Mar 2002 07:28:26 +0000
Subject: Re: PHP Test results
References: 1  Groups: php.qa 
Request: Send a blank email to php-qa+get-4785@lists.php.net to get a copy of this message
On 27 Mar 2002 noreply@php.net wrote: > array ( > 'user_name' => 'Melvyn Sopacua', > 'email' => 'msopacua@idg.nl', > 'package' => '4.2.0-RC1', > 'testcase' => '0', > 'status' => 'Fail', > 'os' => 'other', > 'problems' => 'make[3]: Entering directory > `/home/mdev/_src/php-4.2.0RC1/ext/sysvsem\' > gcc -I. -I/home/mdev/_src/php-4.2.0RC1/ext/sysvsem -I/home/mdev/_src/php-4.2.0RC1/main > -I/home/mdev/_src/php-4.2.0RC1 -I/home/mdev/_src > /apache_1.3.24/src/include -I/home/mdev/_src/apache_1.3.24/src/os/unix > -I/home/mdev/_src/php-4.2.0RC1/Zend -I/weblib/local/include -I/w > eblib/local/include/libxml2 -I/weblib/local/include/freetype2/freetype > -I/weblib/local/include/mysql -I/pgsql/include -I/home/mdev/_sr > c/php-4.2.0RC1/TSRM -g -O2 -c sysvsem.c && touch sysvsem.lo > sysvsem.c: In function `zif_sem_remove\': > sysvsem.c:414: incompatible type for argument 4 of `semctl\' > make[3]: *** [sysvsem.lo] Error 1 > make[3]: Leaving directory `/home/mdev/_src/php-4.2.0RC1/ext/sysvsem\' > make[2]: *** [all-recursive] Error 1 > make[2]: Leaving directory `/home/mdev/_src/php-4.2.0RC1/ext/sysvsem\' > make[1]: *** [all-recursive] Error 1 > make[1]: Leaving directory `/home/mdev/_src/php-4.2.0RC1/ext\' > make: *** [all-recursive] Error 1 > ', > 'bugids' => '', > 'remarks' => 'Might be interesting: > var_unserializer.c: In function `php_var_unserialize\': > var_unserializer.c:300: warning: comparison is always false due to limited range of data type > > Unrelated to compile failure though This is generated code, and I think it's not harmful. > > OS: BSDI 4.2 What does the manpage of semctl say about it? Derick ----------------------------------------------------------------------- PHP: Scripting the Web - derick@php.net All your branches are belong to me! SRM: Script Running Machine - www.vl-srm.net -----------------------------------------------------------------------

« previous php.qa (#4785) next »