PHP Test results

From: Date: Tue, 09 Apr 2002 15:05:42 +0000
Subject: PHP Test results
Groups: php.qa 
Request: Send a blank email to php-qa+get-4988@lists.php.net to get a copy of this message
array ( 'user_name' => 'Joacim Ekroth', 'email' => 'hemi@algonet.se', 'package' => '4.2.0-RC2', 'testcase' => '0', 'status' => 'Fail', 'os' => 'Linux other', 'sapi' => 'Apache 2.x DSO', 'automake' => '16', 'autoconf' => '253', 'libtool' => '140', 'bison' => 'other', 'mcrypt' => 'on', 'mhash' => 'on', 'mysql' => 'on', 'test' => 'Trying to compile with Apache 2.0.35', 'problems' => '\'make\' fails with the following errors: Making all in sapi make[1]: Entering directory `/tmp/php-4.2.0RC2/sapi\' Making all in apache2filter make[2]: Entering directory `/tmp/php-4.2.0RC2/sapi/apache2filter\' make[3]: Entering directory `/tmp/php-4.2.0RC2/sapi/apache2filter\' /bin/sh /tmp/php-4.2.0RC2/libtool --silent --mode=compile gcc -I. -I/tmp/php-4.2.0RC2/sapi/apache2filter -I/tmp/php-4.2.0RC2/main -I/tmp/php-4.2.0RC2 -I/usr/local/apache-2.0.35/include -I/tmp/php-4.2.0RC2/Zend -I/usr/local/include -I/usr/include/mysql -I/tmp/php-4.2.0RC2/ext/xml/expat -D_REENTRANT -I/tmp/php-4.2.0RC2/TSRM -O3 -march=pentium -mcpu=pentium -ffast-math -funroll-loops -fomit-frame-pointer -fforce-mem -fforce-addr -malign-double -fno-exceptions -pthread -DZTS -prefer-pic -c sapi_apache2.c sapi_apache2.c: In function `php_apache_sapi_ub_write\': sapi_apache2.c:58: too few arguments to function `apr_brigade_create\' sapi_apache2.c:61: too few arguments to function `apr_bucket_transient_create\' sapi_apache2.c: In function `php_apache_sapi_flush\': sapi_apache2.c:174: too few arguments to function `apr_brigade_create\' sapi_apache2.c:175: too few arguments to function `apr_bucket_flush_create\' sapi_apache2.c: In function `php_input_filter\': sapi_apache2.c:257: too few arguments to function `apr_brigade_create\' sapi_apache2.c: In function `php_output_filter\': sapi_apache2.c:331: too few arguments to function `apr_brigade_create\' sapi_apache2.c:386: too few arguments to function `apr_bucket_transient_create\' sapi_apache2.c:395: too few arguments to function `apr_bucket_eos_create\' make[3]: *** [sapi_apache2.lo] Error 1 make[3]: Leaving directory `/tmp/php-4.2.0RC2/sapi/apache2filter\' make[2]: *** [all-recursive] Error 1 make[2]: Leaving directory `/tmp/php-4.2.0RC2/sapi/apache2filter\' make[1]: *** [all-recursive] Error 1 make[1]: Leaving directory `/tmp/php-4.2.0RC2/sapi\' make: *** [all-recursive] Error 1', 'bugids' => '', 'remarks' => 'root /tmp # echo $CFLAGS -O3 -march=pentium -mcpu=pentium -ffast-math -funroll-loops -fomit-frame-pointer -fforce-mem -fforce-addr -malign-double -fno-exceptions root /tmp # uname -a Linux xxx.xxx.xxx 2.2.20 #1 Tue Dec 18 20:39:43 CET 2001 i586 unknown root /tmp # bison --version bison (GNU Bison) 1.35 root /tmp # automake --version automake (GNU automake) 1.6 root /tmp # autoconf --version autoconf (GNU Autoconf) 2.53 root /tmp # libtool --version ltmain.sh (GNU libtool) 1.4.2 (1.922.2.53 2001/09/11 03:18:52) root /tmp/php-4.2.0RC2 # ./libtool --version ltmain.sh (GNU libtool) 1.4 (1.920 2001/04/24 23:26:18) PHP configure-string: ./configure --with-apxs2=/usr/local/apache-2.0.35/bin/apxs --with-mysql=/usr --with-mcrypt=/usr/local --with-mhash=/usr/local Apache configure-string: ./configure --prefix=/usr/local/apache-2.0.35', )

« previous php.qa (#4988) next »