PHP Test results

From: Date: Tue, 09 Apr 2002 14:52:49 +0000
Subject: PHP Test results
Groups: php.qa 
Request: Send a blank email to php-qa+get-4987@lists.php.net to get a copy of this message
array ( 'user_name' => 'Rubberneck', 'email' => 'rubberneck@wwisp.com', 'package' => '4.2.0-RC2', 'testcase' => '0', 'status' => 'Fail', 'os' => 'Linux i386', 'sapi' => 'Apache 2.x DSO', 'automake' => '14', 'autoconf' => '213', 'libtool' => '140', 'bison' => '128', 'gd' => 'on', 'mysql' => 'on', 'zlib' => 'on', 'test' => 'Building with apache 2.0.35 Build fails. ', 'problems' => 'make[3]: Entering directory `/usr/src/php-4.2.0RC2/sapi/apache2filter\' /bin/sh /usr/src/php-4.2.0RC2/libtool --silent --mode=compile gcc -I. -I/usr/src/php-4.2.0RC2/sapi/apache2filter -I/usr/src/php-4.2.0RC2/main -I/usr/src/php-4.2.0RC2 -I/usr/local/apache2/include -I/usr/src/php-4.2.0RC2/Zend -I/usr/include/mysql -I/usr/src/php-4.2.0RC2/ext/xml/expat -D_REENTRANT -I/usr/src/php-4.2.0RC2/TSRM -g -O2 -pthread -DZTS -prefer-pic -c sapi_apache2.c sapi_apache2.c: In function `php_apache_sapi_ub_write\': sapi_apache2.c:58: too few arguments to function `apr_brigade_create\' sapi_apache2.c:61: too few arguments to function `apr_bucket_transient_create\' sapi_apache2.c: In function `php_apache_sapi_flush\': sapi_apache2.c:174: too few arguments to function `apr_brigade_create\' sapi_apache2.c:175: too few arguments to function `apr_bucket_flush_create\' sapi_apache2.c: In function `php_input_filter\': sapi_apache2.c:257: too few arguments to function `apr_brigade_create\' sapi_apache2.c: In function `php_output_filter\': sapi_apache2.c:331: too few arguments to function `apr_brigade_create\' sapi_apache2.c:386: too few arguments to function `apr_bucket_transient_create\' sapi_apache2.c:395: too few arguments to function `apr_bucket_eos_create\' make[3]: *** [sapi_apache2.lo] Error 1 make[3]: Leaving directory `/usr/src/php-4.2.0RC2/sapi/apache2filter\' make[2]: *** [all-recursive] Error 1 make[2]: Leaving directory `/usr/src/php-4.2.0RC2/sapi/apache2filter\' make[1]: *** [all-recursive] Error 1 make[1]: Leaving directory `/usr/src/php-4.2.0RC2/sapi\' make: *** [all-recursive] Error 1 ', 'bugids' => '', 'remarks' => '', )

« previous php.qa (#4987) next »