Test results

From: Date: Mon, 09 Dec 2002 14:10:51 +0000
Subject: Test results
Groups: php.qa 
Request: Send a blank email to php-qa+get-7147@lists.php.net to get a copy of this message
===================================================================== FAILED TEST SUMMARY --------------------------------------------------------------------- session object serialization [ext/session/tests/001.phpt] session object deserialization [ext/session/tests/003.phpt] correct instantiation of references between variables in sessions [ext/session/tests/006.phpt] bug compatibility: unset($c) with enabled register_globals [ext/session/tests/007.phpt] bug compatibility: global is used albeit register_globals=0 [ext/session/tests/008-php4.2.3.phpt] unset($_SESSION["name"]); should work with register_globals=off [ext/session/tests/009.phpt] registering $_SESSION should not segfault [ext/session/tests/012.phpt] redefining SID should not cause warnings [ext/session/tests/013.phpt] a script should not be able to modify session.use_trans_sid [ext/session/tests/014.phpt] use_trans_sid should not affect SID [ext/session/tests/015.phpt] setting $_SESSION before session_start() should not cause segfault [ext/session/tests/017.phpt] rewriter correctly handles attribute names which contain dashes [ext/session/tests/018.phpt] serializing references test case using globals [ext/session/tests/019.phpt] rewriter uses arg_seperator.output for modifying URLs [ext/session/tests/020.phpt] rewriter handles form and fieldset tags correctly [ext/session/tests/021.phpt] ===================================================================== ================================================================================ /usr/src/php-4.3.0RC2/ext/session/tests/001.phpt ================================================================================ ---- EXPECTED OUTPUT baz|O:3:"foo":2:{s:3:"bar";s:2:"ok";s:3:"yes";s:4:"done";}arr|a:1:{i:3;O:3:"foo":2:{s:3:"bar";s:2:"ok";s:3:"yes";s:4:"done";}} ---- ACTUAL OUTPUT Warning: open(/tmpfs/sessions/sess_3c0e3454122aa8633b1329d9d0fc353b, O_RDWR) failed: No such file or directory (2) in /usr/src/php-4.3.0RC2/ext/session/tests/001.php on line 16 baz|O:3:"foo":2:{s:3:"bar";s:2:"ok";s:3:"yes";s:4:"done";}arr|a:1:{i:3;O:3:"foo":2:{s:3:"bar";s:2:"ok";s:3:"yes";s:4:"done";}} Warning: Session object destruction failed in /usr/src/php-4.3.0RC2/ext/session/tests/001.php on line 21 ---- FAILED ================================================================================ 001- baz|O:3:"foo":2:{s:3:"bar";s:2:"ok";s:3:"yes";s:4:"done";}arr|a:1:{i:3;O:3:"foo":2:{s:3:"bar";s:2:"ok";s:3:"yes";s:4:"done";}} 001+ Warning: open(/tmpfs/sessions/sess_3c0e3454122aa8633b1329d9d0fc353b, O_RDWR) failed: No such file or directory (2) in /usr/src/php-4.3.0RC2/ext/session/tests/001.php on line 16 002+ baz|O:3:"foo":2:{s:3:"bar";s:2:"ok";s:3:"yes";s:4:"done";}arr|a:1:{i:3;O:3:"foo":2:{s:3:"bar";s:2:"ok";s:3:"yes";s:4:"done";}} 003+ 004+ Warning: Session object destruction failed in /usr/src/php-4.3.0RC2/ext/session/tests/001.php on line 21 ================================================================================ ================================================================================ /usr/src/php-4.3.0RC2/ext/session/tests/003.phpt ================================================================================ ---- EXPECTED OUTPUT object(foo)(2) { ["bar"]=> string(2) "ok" ["yes"]=> int(2) } array(1) { [3]=> &object(foo)(2) { ["bar"]=> string(2) "ok" ["yes"]=> int(2) } } ---- ACTUAL OUTPUT Warning: open(/tmpfs/sessions/sess_abtest, O_RDWR) failed: No such file or directory (2) in /usr/src/php-4.3.0RC2/ext/session/tests/003.php on line 10 object(foo)(2) { ["bar"]=> string(2) "ok" ["yes"]=> int(2) } array(1) { [3]=> &object(foo)(2) { ["bar"]=> string(2) "ok" ["yes"]=> int(2) } } Warning: Session object destruction failed in /usr/src/php-4.3.0RC2/ext/session/tests/003.php on line 18 ---- FAILED ================================================================================ 001- object(foo)(2) { 001+ Warning: open(/tmpfs/sessions/sess_abtest, O_RDWR) failed: No such file or directory (2) in /usr/src/php-4.3.0RC2/ext/session/tests/003.php on line 10 002- ["bar"]=> 002+ object(foo)(2) { 003- string(2) "ok" 003+ ["bar"]=> 004- ["yes"]=> 004+ string(2) "ok" 005- int(2) 005+ ["yes"]=> 006- } 006+ int(2) 007- array(1) { 007+ } 008- [3]=> 008+ array(1) { 009- &object(foo)(2) { 009+ [3]=> 010- ["bar"]=> 010+ &object(foo)(2) { 011- string(2) "ok" 011+ ["bar"]=> 012- ["yes"]=> 012+ string(2) "ok" 013- int(2) 013+ ["yes"]=> 014- } 014+ int(2) 015- } 015+ } 016+ } 017+ 018+ Warning: Session object destruction failed in /usr/src/php-4.3.0RC2/ext/session/tests/003.php on line 18 ================================================================================ ================================================================================ /usr/src/php-4.3.0RC2/ext/session/tests/006.phpt ================================================================================ ---- EXPECTED OUTPUT original values: object(a)(1) { ["test"]=> string(5) "hallo" } object(b)(1) { ["a"]=> &object(a)(1) { ["test"]=> string(5) "hallo" } } values after session: object(a)(1) { ["test"]=> string(5) "hallo" } object(b)(1) { ["a"]=> &object(a)(1) { ["test"]=> string(5) "hallo" } } ---- ACTUAL OUTPUT Warning: open(/tmpfs/sessions/sess_abtest, O_RDWR) failed: No such file or directory (2) in /usr/src/php-4.3.0RC2/ext/session/tests/006.php on line 5 original values: object(a)(1) { ["test"]=> string(5) "hallo" } object(b)(1) { ["a"]=> &object(a)(1) { ["test"]=> string(5) "hallo" } } Warning: open(/tmpfs/sessions/sess_abtest, O_RDWR) failed: No such file or directory (2) in /usr/src/php-4.3.0RC2/ext/session/tests/006.php on line 26 Warning: Failed to write session data (files). Please verify that the current setting of session.save_path is correct (/tmpfs/sessions) in /usr/src/php-4.3.0RC2/ext/session/tests/006.php on line 26 Warning: open(/tmpfs/sessions/sess_abtest, O_RDWR) failed: No such file or directory (2) in /usr/src/php-4.3.0RC2/ext/session/tests/006.php on line 31 values after session: object(a)(1) { ["test"]=> string(5) "hallo" } object(b)(1) { ["a"]=> &object(a)(1) { ["test"]=> string(5) "hallo" } } Warning: open(/tmpfs/sessions/sess_abtest, O_RDWR) failed: No such file or directory (2) in Unknown on line 0 Warning: Failed to write session data (files). Please verify that the current setting of session.save_path is correct (/tmpfs/sessions) in Unknown on line 0 ---- FAILED ================================================================================ 001- original values: 001+ Warning: open(/tmpfs/sessions/sess_abtest, O_RDWR) failed: No such file or directory (2) in /usr/src/php-4.3.0RC2/ext/session/tests/006.php on line 5 002- object(a)(1) { 002+ original values: 003- ["test"]=> 003+ object(a)(1) { 004- string(5) "hallo" 004+ ["test"]=> 005- } 005+ string(5) "hallo" 006- object(b)(1) { 006+ } 007- ["a"]=> 007+ object(b)(1) { 008- &object(a)(1) { 008+ ["a"]=> 009- ["test"]=> 009+ &object(a)(1) { 010- string(5) "hallo" 010+ ["test"]=> 011- } 011+ string(5) "hallo" 012- } 012+ } 013- values after session: 013+ } 014- object(a)(1) { 014+ 015- ["test"]=> 015+ Warning: open(/tmpfs/sessions/sess_abtest, O_RDWR) failed: No such file or directory (2) in /usr/src/php-4.3.0RC2/ext/session/tests/006.php on line 26 016- string(5) "hallo" 016+ 017- } 017+ Warning: Failed to write session data (files). Please verify that the current setting of session.save_path is correct (/tmpfs/sessions) in /usr/src/php-4.3.0RC2/ext/session/tests/006.php on line 26 018- object(b)(1) { 018+ 019- ["a"]=> 019+ Warning: open(/tmpfs/sessions/sess_abtest, O_RDWR) failed: No such file or directory (2) in /usr/src/php-4.3.0RC2/ext/session/tests/006.php on line 31 020- &object(a)(1) { 020+ values after session: 021- ["test"]=> 021+ object(a)(1) { 022- string(5) "hallo" 022+ ["test"]=> 023- } 023+ string(5) "hallo" 025+ object(b)(1) { 026+ ["a"]=> 027+ &object(a)(1) { 028+ ["test"]=> 029+ string(5) "hallo" 030+ } 031+ } 032+ 033+ Warning: open(/tmpfs/sessions/sess_abtest, O_RDWR) failed: No such file or directory (2) in Unknown on line 0 034+ 035+ Warning: Failed to write session data (files). Please verify that the current setting of session.save_path is correct (/tmpfs/sessions) in Unknown on line 0 ================================================================================ ================================================================================ /usr/src/php-4.3.0RC2/ext/session/tests/007.phpt ================================================================================ ---- EXPECTED OUTPUT float(3.14) array(1) { ["c"]=> &float(3.14) } float(3.14) array(1) { ["c"]=> &float(3.14) } ---- ACTUAL OUTPUT Warning: open(/tmpfs/sessions/sess_abtest, O_RDWR) failed: No such file or directory (2) in /usr/src/php-4.3.0RC2/ext/session/tests/007.php on line 7 Warning: Session object destruction failed in /usr/src/php-4.3.0RC2/ext/session/tests/007.php on line 8 Warning: open(/tmpfs/sessions/sess_abtest, O_RDWR) failed: No such file or directory (2) in /usr/src/php-4.3.0RC2/ext/session/tests/007.php on line 12 Warning: open(/tmpfs/sessions/sess_abtest, O_RDWR) failed: No such file or directory (2) in /usr/src/php-4.3.0RC2/ext/session/tests/007.php on line 15 Warning: Failed to write session data (files). Please verify that the current setting of session.save_path is correct (/tmpfs/sessions) in /usr/src/php-4.3.0RC2/ext/session/tests/007.php on line 15 Warning: open(/tmpfs/sessions/sess_abtest, O_RDWR) failed: No such file or directory (2) in /usr/src/php-4.3.0RC2/ext/session/tests/007.php on line 20 Notice: Undefined variable: c in /usr/src/php-4.3.0RC2/ext/session/tests/007.php on line 21 NULL array(0) { } Warning: open(/tmpfs/sessions/sess_abtest, O_RDWR) failed: No such file or directory (2) in /usr/src/php-4.3.0RC2/ext/session/tests/007.php on line 26 Warning: Failed to write session data (files). Please verify that the current setting of session.save_path is correct (/tmpfs/sessions) in /usr/src/php-4.3.0RC2/ext/session/tests/007.php on line 26 Warning: open(/tmpfs/sessions/sess_abtest, O_RDWR) failed: No such file or directory (2) in /usr/src/php-4.3.0RC2/ext/session/tests/007.php on line 32 Notice: Undefined variable: c in /usr/src/php-4.3.0RC2/ext/session/tests/007.php on line 33 NULL array(0) { } Warning: Session object destruction failed in /usr/src/php-4.3.0RC2/ext/session/tests/007.php on line 36 ---- FAILED ================================================================================ 001- float(3.14) 001+ Warning: open(/tmpfs/sessions/sess_abtest, O_RDWR) failed: No such file or directory (2) in /usr/src/php-4.3.0RC2/ext/session/tests/007.php on line 7 002- array(1) { 002+ 003- ["c"]=> 003+ Warning: Session object destruction failed in /usr/src/php-4.3.0RC2/ext/session/tests/007.php on line 8 004- &float(3.14) 004+ 005- } 005+ Warning: open(/tmpfs/sessions/sess_abtest, O_RDWR) failed: No such file or directory (2) in /usr/src/php-4.3.0RC2/ext/session/tests/007.php on line 12 006- float(3.14) 006+ 007- array(1) { 007+ Warning: open(/tmpfs/sessions/sess_abtest, O_RDWR) failed: No such file or directory (2) in /usr/src/php-4.3.0RC2/ext/session/tests/007.php on line 15 008- ["c"]=> 008+ 009- &float(3.14) 009+ Warning: Failed to write session data (files). Please verify that the current setting of session.save_path is correct (/tmpfs/sessions) in /usr/src/php-4.3.0RC2/ext/session/tests/007.php on line 15 010- } 010+ 011+ Warning: open(/tmpfs/sessions/sess_abtest, O_RDWR) failed: No such file or directory (2) in /usr/src/php-4.3.0RC2/ext/session/tests/007.php on line 20 012+ 013+ Notice: Undefined variable: c in /usr/src/php-4.3.0RC2/ext/session/tests/007.php on line 21 014+ NULL 015+ array(0) { 016+ } 017+ 018+ Warning: open(/tmpfs/sessions/sess_abtest, O_RDWR) failed: No such file or directory (2) in /usr/src/php-4.3.0RC2/ext/session/tests/007.php on line 26 019+ 020+ Warning: Failed to write session data (files). Please verify that the current setting of session.save_path is correct (/tmpfs/sessions) in /usr/src/php-4.3.0RC2/ext/session/tests/007.php on line 26 021+ 022+ Warning: open(/tmpfs/sessions/sess_abtest, O_RDWR) failed: No such file or directory (2) in /usr/src/php-4.3.0RC2/ext/session/tests/007.php on line 32 023+ 024+ Notice: Undefined variable: c in /usr/src/php-4.3.0RC2/ext/session/tests/007.php on line 33 025+ NULL 026+ array(0) { 027+ } 028+ 029+ Warning: Session object destruction failed in /usr/src/php-4.3.0RC2/ext/session/tests/007.php on line 36 ================================================================================ ================================================================================ /usr/src/php-4.3.0RC2/ext/session/tests/008-php4.2.3.phpt ================================================================================ ---- EXPECTED OUTPUT NULL Your script possibly relies on a session side-effect which existed until PHP 4.2.3. Please be advised that the session extension does not consider global variables as a source of data, unless register_globals is enabled. You can disable this functionality and this warning by setting session.bug_compat_42 or session.bug_compat_warn to off, respectively. array(1) { ["c"]=> float(3.14) } NULL array(1) { ["c"]=> float(3.14) } ---- ACTUAL OUTPUT Warning: open(/tmpfs/sessions/sess_abtest, O_RDWR) failed: No such file or directory (2) in /usr/src/php-4.3.0RC2/ext/session/tests/008-php4.2.3.php on line 5 Warning: Session object destruction failed in /usr/src/php-4.3.0RC2/ext/session/tests/008-php4.2.3.php on line 6 Warning: open(/tmpfs/sessions/sess_abtest, O_RDWR) failed: No such file or directory (2) in /usr/src/php-4.3.0RC2/ext/session/tests/008-php4.2.3.php on line 10 NULL Failed to write session data (files). Please verify that the current setting of session.save_path is correct (/tmpfs/sessions) Warning: open(/tmpfs/sessions/sess_abtest, O_RDWR) failed: No such file or directory (2) in /usr/src/php-4.3.0RC2/ext/session/tests/008-php4.2.3.php on line 21 array(0) { } Warning: open(/tmpfs/sessions/sess_abtest, O_RDWR) failed: No such file or directory (2) in /usr/src/php-4.3.0RC2/ext/session/tests/008-php4.2.3.php on line 26 Warning: Failed to write session data (files). Please verify that the current setting of session.save_path is correct (/tmpfs/sessions) in /usr/src/php-4.3.0RC2/ext/session/tests/008-php4.2.3.php on line 26 Warning: open(/tmpfs/sessions/sess_abtest, O_RDWR) failed: No such file or directory (2) in /usr/src/php-4.3.0RC2/ext/session/tests/008-php4.2.3.php on line 32 NULL array(0) { } Warning: Session object destruction failed in /usr/src/php-4.3.0RC2/ext/session/tests/008-php4.2.3.php on line 36 ---- FAILED ================================================================================ 001- NULL 001+ Warning: open(/tmpfs/sessions/sess_abtest, O_RDWR) failed: No such file or directory (2) in /usr/src/php-4.3.0RC2/ext/session/tests/008-php4.2.3.php on line 5 002- Your script possibly relies on a session side-effect which existed until PHP 4.2.3. Please be advised that the session extension does not consider global variables as a source of data, unless register_globals is enabled. You can disable this functionality and this warning by setting session.bug_compat_42 or session.bug_compat_warn to off, respectively. 002+ 003- array(1) { 003+ Warning: Session object destruction failed in /usr/src/php-4.3.0RC2/ext/session/tests/008-php4.2.3.php on line 6 004- ["c"]=> 004+ 005- float(3.14) 005+ Warning: open(/tmpfs/sessions/sess_abtest, O_RDWR) failed: No such file or directory (2) in /usr/src/php-4.3.0RC2/ext/session/tests/008-php4.2.3.php on line 10 006- } 006+ NULL 007- NULL 007+ Failed to write session data (files). Please verify that the current setting of session.save_path is correct (/tmpfs/sessions) 008- array(1) { 008+ 009- ["c"]=> 009+ Warning: open(/tmpfs/sessions/sess_abtest, O_RDWR) failed: No such file or directory (2) in /usr/src/php-4.3.0RC2/ext/session/tests/008-php4.2.3.php on line 21 010- float(3.14) 010+ array(0) { 012+ 013+ Warning: open(/tmpfs/sessions/sess_abtest, O_RDWR) failed: No such file or directory (2) in /usr/src/php-4.3.0RC2/ext/session/tests/008-php4.2.3.php on line 26 014+ 015+ Warning: Failed to write session data (files). Please verify that the current setting of session.save_path is correct (/tmpfs/sessions) in /usr/src/php-4.3.0RC2/ext/session/tests/008-php4.2.3.php on line 26 016+ 017+ Warning: open(/tmpfs/sessions/sess_abtest, O_RDWR) failed: No such file or directory (2) in /usr/src/php-4.3.0RC2/ext/session/tests/008-php4.2.3.php on line 32 018+ NULL 019+ array(0) { 020+ } 021+ 022+ Warning: Session object destruction failed in /usr/src/php-4.3.0RC2/ext/session/tests/008-php4.2.3.php on line 36 ================================================================================ ================================================================================ /usr/src/php-4.3.0RC2/ext/session/tests/009.phpt ================================================================================ ---- EXPECTED OUTPUT array(0) { } array(1) { ["name"]=> string(3) "foo" } array(1) { ["name"]=> string(3) "foo" } array(0) { } array(0) { } ---- ACTUAL OUTPUT Warning: open(/tmpfs/sessions/sess_abtest, O_RDWR) failed: No such file or directory (2) in /usr/src/php-4.3.0RC2/ext/session/tests/009.php on line 7 Warning: Session object destruction failed in /usr/src/php-4.3.0RC2/ext/session/tests/009.php on line 8 Warning: open(/tmpfs/sessions/sess_abtest, O_RDWR) failed: No such file or directory (2) in /usr/src/php-4.3.0RC2/ext/session/tests/009.php on line 12 array(0) { } array(1) { ["name"]=> string(3) "foo" } Warning: open(/tmpfs/sessions/sess_abtest, O_RDWR) failed: No such file or directory (2) in /usr/src/php-4.3.0RC2/ext/session/tests/009.php on line 16 Warning: Failed to write session data (files). Please verify that the current setting of session.save_path is correct (/tmpfs/sessions) in /usr/src/php-4.3.0RC2/ext/session/tests/009.php on line 16 Warning: open(/tmpfs/sessions/sess_abtest, O_RDWR) failed: No such file or directory (2) in /usr/src/php-4.3.0RC2/ext/session/tests/009.php on line 19 array(0) { } array(0) { } Warning: open(/tmpfs/sessions/sess_abtest, O_RDWR) failed: No such file or directory (2) in /usr/src/php-4.3.0RC2/ext/session/tests/009.php on line 23 Warning: Failed to write session data (files). Please verify that the current setting of session.save_path is correct (/tmpfs/sessions) in /usr/src/php-4.3.0RC2/ext/session/tests/009.php on line 23 Warning: open(/tmpfs/sessions/sess_abtest, O_RDWR) failed: No such file or directory (2) in /usr/src/php-4.3.0RC2/ext/session/tests/009.php on line 27 array(0) { } Warning: Session object destruction failed in /usr/src/php-4.3.0RC2/ext/session/tests/009.php on line 29 ---- FAILED ================================================================================ 001- array(0) { 001+ Warning: open(/tmpfs/sessions/sess_abtest, O_RDWR) failed: No such file or directory (2) in /usr/src/php-4.3.0RC2/ext/session/tests/009.php on line 7 002- } 002+ 003- array(1) { 003+ Warning: Session object destruction failed in /usr/src/php-4.3.0RC2/ext/session/tests/009.php on line 8 004- ["name"]=> 004+ 005- string(3) "foo" 005+ Warning: open(/tmpfs/sessions/sess_abtest, O_RDWR) failed: No such file or directory (2) in /usr/src/php-4.3.0RC2/ext/session/tests/009.php on line 12 006- } 006+ array(0) { 007- array(1) { 007+ } 008- ["name"]=> 008+ array(1) { 009- string(3) "foo" 009+ ["name"]=> 010- } 010+ string(3) "foo" 011- array(0) { 011+ } 012- } 012+ 013- array(0) { 013+ Warning: open(/tmpfs/sessions/sess_abtest, O_RDWR) failed: No such file or directory (2) in /usr/src/php-4.3.0RC2/ext/session/tests/009.php on line 16 014- } 014+ 015+ Warning: Failed to write session data (files). Please verify that the current setting of session.save_path is correct (/tmpfs/sessions) in /usr/src/php-4.3.0RC2/ext/session/tests/009.php on line 16 016+ 017+ Warning: open(/tmpfs/sessions/sess_abtest, O_RDWR) failed: No such file or directory (2) in /usr/src/php-4.3.0RC2/ext/session/tests/009.php on line 19 018+ array(0) { 019+ } 020+ array(0) { 021+ } 022+ 023+ Warning: open(/tmpfs/sessions/sess_abtest, O_RDWR) failed: No such file or directory (2) in /usr/src/php-4.3.0RC2/ext/session/tests/009.php on line 23 024+ 025+ Warning: Failed to write session data (files). Please verify that the current setting of session.save_path is correct (/tmpfs/sessions) in /usr/src/php-4.3.0RC2/ext/session/tests/009.php on line 23 026+ 027+ Warning: open(/tmpfs/sessions/sess_abtest, O_RDWR) failed: No such file or directory (2) in /usr/src/php-4.3.0RC2/ext/session/tests/009.php on line 27 028+ array(0) { 029+ } 030+ 031+ Warning: Session object destruction failed in /usr/src/php-4.3.0RC2/ext/session/tests/009.php on line 29 ================================================================================ ================================================================================ /usr/src/php-4.3.0RC2/ext/session/tests/012.phpt ================================================================================ ---- EXPECTED OUTPUT I live ---- ACTUAL OUTPUT Warning: open(/tmpfs/sessions/sess_abtest, O_RDWR) failed: No such file or directory (2) in /usr/src/php-4.3.0RC2/ext/session/tests/012.php on line 7 Warning: open(/tmpfs/sessions/sess_abtest, O_RDWR) failed: No such file or directory (2) in /usr/src/php-4.3.0RC2/ext/session/tests/012.php on line 15 Warning: Session object destruction failed in /usr/src/php-4.3.0RC2/ext/session/tests/012.php on line 17 I live ---- FAILED ================================================================================ 001- I live 001+ Warning: open(/tmpfs/sessions/sess_abtest, O_RDWR) failed: No such file or directory (2) in /usr/src/php-4.3.0RC2/ext/session/tests/012.php on line 7 002+ 003+ Warning: open(/tmpfs/sessions/sess_abtest, O_RDWR) failed: No such file or directory (2) in /usr/src/php-4.3.0RC2/ext/session/tests/012.php on line 15 004+ 005+ Warning: Session object destruction failed in /usr/src/php-4.3.0RC2/ext/session/tests/012.php on line 17 006+ I live ================================================================================ ================================================================================ /usr/src/php-4.3.0RC2/ext/session/tests/013.phpt ================================================================================ ---- EXPECTED OUTPUT I live ---- ACTUAL OUTPUT Warning: open(/tmpfs/sessions/sess_abtest, O_RDWR) failed: No such file or directory (2) in /usr/src/php-4.3.0RC2/ext/session/tests/013.php on line 5 Warning: Session object destruction failed in /usr/src/php-4.3.0RC2/ext/session/tests/013.php on line 6 Warning: open(/tmpfs/sessions/sess_abtest2, O_RDWR) failed: No such file or directory (2) in /usr/src/php-4.3.0RC2/ext/session/tests/013.php on line 8 Warning: Session object destruction failed in /usr/src/php-4.3.0RC2/ext/session/tests/013.php on line 9 I live ---- FAILED ================================================================================ 001- I live 001+ Warning: open(/tmpfs/sessions/sess_abtest, O_RDWR) failed: No such file or directory (2) in /usr/src/php-4.3.0RC2/ext/session/tests/013.php on line 5 002+ 003+ Warning: Session object destruction failed in /usr/src/php-4.3.0RC2/ext/session/tests/013.php on line 6 004+ 005+ Warning: open(/tmpfs/sessions/sess_abtest2, O_RDWR) failed: No such file or directory (2) in /usr/src/php-4.3.0RC2/ext/session/tests/013.php on line 8 006+ 007+ Warning: Session object destruction failed in /usr/src/php-4.3.0RC2/ext/session/tests/013.php on line 9 008+ I live ================================================================================ ================================================================================ /usr/src/php-4.3.0RC2/ext/session/tests/014.phpt ================================================================================ ---- EXPECTED OUTPUT <a href="/link?PHPSESSID=abtest"> <a href="/link?PHPSESSID=abtest"> <a href="/link?PHPSESSID=abtest"> ---- ACTUAL OUTPUT Warning: open(/tmpfs/sessions/sess_abtest, O_RDWR) failed: No such file or directory (2) in /usr/src/php-4.3.0RC2/ext/session/tests/014.php on line 5 <a href="/link?PHPSESSID=abtest"> <a href="/link?PHPSESSID=abtest"> <a href="/link?PHPSESSID=abtest"> Warning: Session object destruction failed in /usr/src/php-4.3.0RC2/ext/session/tests/014.php on line 18 ---- FAILED ================================================================================ 001- <a href="/link?PHPSESSID=abtest"> 001+ Warning: open(/tmpfs/sessions/sess_abtest, O_RDWR) failed: No such file or directory (2) in /usr/src/php-4.3.0RC2/ext/session/tests/014.php on line 5 004+ <a href="/link?PHPSESSID=abtest"> 005+ 006+ Warning: Session object destruction failed in /usr/src/php-4.3.0RC2/ext/session/tests/014.php on line 18 ================================================================================ ================================================================================ /usr/src/php-4.3.0RC2/ext/session/tests/015.phpt ================================================================================ ---- EXPECTED OUTPUT <a href="/link?PHPSESSID=abtest&PHPSESSID=abtest"> ---- ACTUAL OUTPUT Warning: open(/tmpfs/sessions/sess_abtest, O_RDWR) failed: No such file or directory (2) in /usr/src/php-4.3.0RC2/ext/session/tests/015.php on line 5 <a href="/link?PHPSESSID=abtest&PHPSESSID=abtest"> Warning: Session object destruction failed in /usr/src/php-4.3.0RC2/ext/session/tests/015.php on line 9 ---- FAILED ================================================================================ 001- <a href="/link?PHPSESSID=abtest&PHPSESSID=abtest"> 001+ Warning: open(/tmpfs/sessions/sess_abtest, O_RDWR) failed: No such file or directory (2) in /usr/src/php-4.3.0RC2/ext/session/tests/015.php on line 5 002+ <a href="/link?PHPSESSID=abtest&PHPSESSID=abtest"> 003+ 004+ Warning: Session object destruction failed in /usr/src/php-4.3.0RC2/ext/session/tests/015.php on line 9 ================================================================================ ================================================================================ /usr/src/php-4.3.0RC2/ext/session/tests/017.phpt ================================================================================ ---- EXPECTED OUTPUT I live ---- ACTUAL OUTPUT Warning: open(/tmpfs/sessions/sess_d9d058ba0a66173a8e5daf5b62f51bb5, O_RDWR) failed: No such file or directory (2) in /usr/src/php-4.3.0RC2/ext/session/tests/017.php on line 8 I live Warning: open(/tmpfs/sessions/sess_d9d058ba0a66173a8e5daf5b62f51bb5, O_RDWR) failed: No such file or directory (2) in Unknown on line 0 Warning: Failed to write session data (files). Please verify that the current setting of session.save_path is correct (/tmpfs/sessions) in Unknown on line 0 ---- FAILED ================================================================================ 001- I live 001+ Warning: open(/tmpfs/sessions/sess_d9d058ba0a66173a8e5daf5b62f51bb5, O_RDWR) failed: No such file or directory (2) in /usr/src/php-4.3.0RC2/ext/session/tests/017.php on line 8 002+ I live 003+ 004+ Warning: open(/tmpfs/sessions/sess_d9d058ba0a66173a8e5daf5b62f51bb5, O_RDWR) failed: No such file or directory (2) in Unknown on line 0 005+ 006+ Warning: Failed to write session data (files). Please verify that the current setting of session.save_path is correct (/tmpfs/sessions) in Unknown on line 0 ================================================================================ ================================================================================ /usr/src/php-4.3.0RC2/ext/session/tests/018.phpt ================================================================================ ---- EXPECTED OUTPUT <form accept-charset="ISO-8859-15, ISO-8859-1" action=url.php><input type="hidden" name="PHPSESSID" value="abtest" /> ---- ACTUAL OUTPUT Warning: open(/tmpfs/sessions/sess_abtest, O_RDWR) failed: No such file or directory (2) in /usr/src/php-4.3.0RC2/ext/session/tests/018.php on line 6 <form accept-charset="ISO-8859-15, ISO-8859-1" action=url.php><input type="hidden" name="PHPSESSID" value="abtest" /> Warning: Session object destruction failed in /usr/src/php-4.3.0RC2/ext/session/tests/018.php on line 10 ---- FAILED ================================================================================ 001- <form accept-charset="ISO-8859-15, ISO-8859-1" action=url.php><input type="hidden" name="PHPSESSID" value="abtest" /> 001+ Warning: open(/tmpfs/sessions/sess_abtest, O_RDWR) failed: No such file or directory (2) in /usr/src/php-4.3.0RC2/ext/session/tests/018.php on line 6 002+ <form accept-charset="ISO-8859-15, ISO-8859-1" action=url.php><input type="hidden" name="PHPSESSID" value="abtest" /> 003+ 004+ Warning: Session object destruction failed in /usr/src/php-4.3.0RC2/ext/session/tests/018.php on line 10 ================================================================================ ================================================================================ /usr/src/php-4.3.0RC2/ext/session/tests/019.phpt ================================================================================ ---- EXPECTED OUTPUT array(2) { ["o1"]=> &object(tfoo)(1) { ["c"]=> int(42) } ["o2"]=> &object(tfoo)(1) { ["c"]=> int(42) } } array(2) { ["o1"]=> &object(tfoo)(1) { ["c"]=> int(44) } ["o2"]=> &object(tfoo)(1) { ["c"]=> int(44) } } ---- ACTUAL OUTPUT Warning: open(/tmpfs/sessions/sess_abtest, O_RDWR) failed: No such file or directory (2) in /usr/src/php-4.3.0RC2/ext/session/tests/019.php on line 16 Warning: open(/tmpfs/sessions/sess_abtest, O_RDWR) failed: No such file or directory (2) in /usr/src/php-4.3.0RC2/ext/session/tests/019.php on line 22 Warning: Failed to write session data (files). Please verify that the current setting of session.save_path is correct (/tmpfs/sessions) in /usr/src/php-4.3.0RC2/ext/session/tests/019.php on line 22 Warning: open(/tmpfs/sessions/sess_abtest, O_RDWR) failed: No such file or directory (2) in /usr/src/php-4.3.0RC2/ext/session/tests/019.php on line 27 array(0) { } Fatal error: Call to a member function on a non-object in /usr/src/php-4.3.0RC2/ext/session/tests/019.php on line 31 Warning: open(/tmpfs/sessions/sess_abtest, O_RDWR) failed: No such file or directory (2) in Unknown on line 0 Warning: Failed to write session data (files). Please verify that the current setting of session.save_path is correct (/tmpfs/sessions) in Unknown on line 0 ---- FAILED ================================================================================ 001- array(2) { 001+ Warning: open(/tmpfs/sessions/sess_abtest, O_RDWR) failed: No such file or directory (2) in /usr/src/php-4.3.0RC2/ext/session/tests/019.php on line 16 002- ["o1"]=> 002+ 003- &object(tfoo)(1) { 003+ Warning: open(/tmpfs/sessions/sess_abtest, O_RDWR) failed: No such file or directory (2) in /usr/src/php-4.3.0RC2/ext/session/tests/019.php on line 22 004- ["c"]=> 004+ 005- int(42) 005+ Warning: Failed to write session data (files). Please verify that the current setting of session.save_path is correct (/tmpfs/sessions) in /usr/src/php-4.3.0RC2/ext/session/tests/019.php on line 22 006- } 006+ 007- ["o2"]=> 007+ Warning: open(/tmpfs/sessions/sess_abtest, O_RDWR) failed: No such file or directory (2) in /usr/src/php-4.3.0RC2/ext/session/tests/019.php on line 27 008- &object(tfoo)(1) { 008+ array(0) { 009- ["c"]=> 009+ } 010- int(42) 010+ 011- } 011+ Fatal error: Call to a member function on a non-object in /usr/src/php-4.3.0RC2/ext/session/tests/019.php on line 31 012- } 012+ 013- array(2) { 013+ Warning: open(/tmpfs/sessions/sess_abtest, O_RDWR) failed: No such file or directory (2) in Unknown on line 0 014- ["o1"]=> 014+ 015- &object(tfoo)(1) { 015+ Warning: Failed to write session data (files). Please verify that the current setting of session.save_path is correct (/tmpfs/sessions) in Unknown on line 0 016- ["c"]=> 017- int(44) 018- } 019- ["o2"]=> 020- &object(tfoo)(1) { 021- ["c"]=> 022- int(44) 023- } 024- } ================================================================================ ================================================================================ /usr/src/php-4.3.0RC2/ext/session/tests/020.phpt ================================================================================ ---- EXPECTED OUTPUT <a href="link.php?a=b&amp;PHPSESSID=abtest"> ---- ACTUAL OUTPUT Warning: open(/tmpfs/sessions/sess_abtest, O_RDWR) failed: No such file or directory (2) in /usr/src/php-4.3.0RC2/ext/session/tests/020.php on line 6 <a href="link.php?a=b&amp;PHPSESSID=abtest"> Warning: Session object destruction failed in /usr/src/php-4.3.0RC2/ext/session/tests/020.php on line 10 ---- FAILED ================================================================================ 001- <a href="link.php?a=b&amp;PHPSESSID=abtest"> 001+ Warning: open(/tmpfs/sessions/sess_abtest, O_RDWR) failed: No such file or directory (2) in /usr/src/php-4.3.0RC2/ext/session/tests/020.php on line 6 002+ <a href="link.php?a=b&amp;PHPSESSID=abtest"> 003+ 004+ Warning: Session object destruction failed in /usr/src/php-4.3.0RC2/ext/session/tests/020.php on line 10 ================================================================================ ================================================================================ /usr/src/php-4.3.0RC2/ext/session/tests/021.phpt ================================================================================ ---- EXPECTED OUTPUT <form><input type="hidden" name="PHPSESSID" value="abtest" /> <fieldset><input type="hidden" name="PHPSESSID" value="abtest" /> <form><input type="hidden" name="PHPSESSID" value="abtest" /> <fieldset> <form><input type="hidden" name="PHPSESSID" value="abtest" /> <fieldset> <form> <fieldset><input type="hidden" name="PHPSESSID" value="abtest" /> ---- ACTUAL OUTPUT Warning: open(/tmpfs/sessions/sess_abtest, O_RDWR) failed: No such file or directory (2) in /usr/src/php-4.3.0RC2/ext/session/tests/021.php on line 6 <form><input type="hidden" name="PHPSESSID" value="abtest" /> <fieldset><input type="hidden" name="PHPSESSID" value="abtest" /> <form><input type="hidden" name="PHPSESSID" value="abtest" /> <fieldset> <form><input type="hidden" name="PHPSESSID" value="abtest" /> <fieldset> <form> <fieldset><input type="hidden" name="PHPSESSID" value="abtest" /> Warning: Session object destruction failed in /usr/src/php-4.3.0RC2/ext/session/tests/021.php on line 39 ---- FAILED ================================================================================ 001- <form><input type="hidden" name="PHPSESSID" value="abtest" /> 001+ Warning: open(/tmpfs/sessions/sess_abtest, O_RDWR) failed: No such file or directory (2) in /usr/src/php-4.3.0RC2/ext/session/tests/021.php on line 6 002- <fieldset><input type="hidden" name="PHPSESSID" value="abtest" /> 002+ <form><input type="hidden" name="PHPSESSID" value="abtest" /> 003- <form><input type="hidden" name="PHPSESSID" value="abtest" /> 003+ <fieldset><input type="hidden" name="PHPSESSID" value="abtest" /> 004- <fieldset> 004+ <form><input type="hidden" name="PHPSESSID" value="abtest" /> 005- <form><input type="hidden" name="PHPSESSID" value="abtest" /> 005+ <fieldset> 006- <fieldset> 006+ <form><input type="hidden" name="PHPSESSID" value="abtest" /> 007- <form> 007+ <fieldset> 008- <fieldset><input type="hidden" name="PHPSESSID" value="abtest" /> 008+ <form> 009+ <fieldset><input type="hidden" name="PHPSESSID" value="abtest" /> 010+ 011+ Warning: Session object destruction failed in /usr/src/php-4.3.0RC2/ext/session/tests/021.php on line 39 ================================================================================ ================================================================================ BUILD ENVIRONMENT ================================================================================ OS: Linux Automake: automake (GNU automake) 1.4 Copyright (C) 1999 Free Software Foundation, Inc. This is free software; see the source for copying conditions. There is NO warranty; not even for MERCHANTABILITY or FITNESS FOR A PARTICULAR PURPOSE. Written by Tom Tromey <tromey@cygnus.com> Autoconf: Autoconf version 2.13 Libtool: ltmain.sh (GNU libtool) 1.3.5 (1.385.2.206 2000/05/27 11:12:27) Compiler: Reading specs from /usr/lib/gcc-lib/i386-redhat-linux/2.96/specs gcc version 2.96 20000731 (Red Hat Linux 7.2 2.96-112.7.1) Bison: GNU Bison version 1.28 ================================================================================ PHPINFO ================================================================================ phpinfo() PHP Version => 4.3.0RC2 System => Linux d45.westmaster.com 2.4.18-18.7.xcustom #3 SMP Sat Nov 23 04:01:04 CET 2002 i686 Build Date => Dec 9 2002 15:07:08 Configure Command => './configure' '--with-tux=/www/tux_modules/' '--with-mysql=/usr/local/mysql' '--enable-track-vars' Server API => Command Line Interface Virtual Directory Support => disabled Configuration File (php.ini) Path => /etc/php.ini PHP API => 20020918 PHP Extension => 20020429 Zend Extension => 20021010 Debug Build => no Thread Safety => disabled Registered PHP Streams => php, http, ftp This program makes use of the Zend Scripting Language Engine: Zend Engine v1.4.0, Copyright (c) 1998-2002 Zend Technologies _______________________________________________________________________ Configuration PHP Core Directive => Local Value => Master Value allow_call_time_pass_reference => On => On allow_url_fopen => On => On always_populate_raw_post_data => Off => Off arg_separator.input => &amp; => &amp; arg_separator.output => &amp; => &amp; asp_tags => Off => Off auto_append_file => no value => no value auto_prepend_file => no value => no value browscap => no value => no value default_charset => no value => no value default_mimetype => text/html => text/html define_syslog_variables => Off => Off disable_functions => no value => no value display_errors => On => On display_startup_errors => Off => Off doc_root => no value => no value docref_ext => no value => no value docref_root => http://www.php.net/ => http://www.php.net/ enable_dl => On => On error_append_string => no value => no value error_log => /www/logs/php_errors => /www/logs/php_errors error_prepend_string => no value => no value error_reporting => 2037 => 2037 expose_php => On => On extension_dir => ./ => ./ file_uploads => Off => Off gpc_order => GPC => GPC highlight.bg => #FFFFFF => #FFFFFF highlight.comment => #FF8000 => #FF8000 highlight.default => #0000BB => #0000BB highlight.html => #000000 => #000000 highlight.keyword => #007700 => #007700 highlight.string => #DD0000 => #DD0000 html_errors => Off => On ignore_repeated_errors => Off => Off ignore_repeated_source => Off => Off ignore_user_abort => Off => Off implicit_flush => On => Off include_path => .:/www/include => .:/www/include log_errors => On => On log_errors_max_len => 1024 => 1024 magic_quotes_gpc => On => On magic_quotes_runtime => Off => Off magic_quotes_sybase => Off => Off max_execution_time => 0 => 30 max_input_time => -1 => -1 open_basedir => no value => no value output_buffering => no value => no value output_handler => no value => no value post_max_size => 8M => 8M precision => 14 => 14 register_argc_argv => On => On register_globals => On => On report_memleaks => On => On safe_mode => Off => Off safe_mode_exec_dir => no value => no value safe_mode_gid => Off => Off safe_mode_include_dir => no value => no value sendmail_from => me@localhost.com => me@localhost.com sendmail_path => -t -i => -t -i short_open_tag => On => On SMTP => localhost => localhost smtp_port => 25 => 25 sql.safe_mode => Off => Off track_errors => Off => Off unserialize_callback_func => no value => no value upload_max_filesize => 2M => 2M upload_tmp_dir => no value => no value user_dir => no value => no value variables_order => EGPCS => EGPCS xmlrpc_error_number => 0 => 0 xmlrpc_errors => Off => Off y2k_compliance => Off => Off ctype ctype functions => enabled mysql MySQL Support => enabled Active Persistent Links => 0 Active Links => 0 Client API version => 3.23.51 MYSQL_MODULE_TYPE => external MYSQL_SOCKET => /tmp/mysql.sock MYSQL_INCLUDE => -I/usr/local/mysql/include/mysql MYSQL_LIBS => -L/usr/local/mysql/lib/mysql -lmysqlclient Directive => Local Value => Master Value mysql.allow_persistent => On => On mysql.connect_timeout => -1 => -1 mysql.default_host => no value => no value mysql.default_password => no value => no value mysql.default_port => no value => no value mysql.default_socket => no value => no value mysql.default_user => no value => no value mysql.max_links => Unlimited => Unlimited mysql.max_persistent => Unlimited => Unlimited mysql.trace_mode => Off => Off overload User-Space Object Overloading Support => enabled pcre PCRE (Perl Compatible Regular Expressions) Support => enabled PCRE Library Version => 3.92 11-Sep-2002 posix Revision => $Revision: 1.51 $ session Session Support => enabled Registered save handlers => files user Directive => Local Value => Master Value session.auto_start => Off => Off session.bug_compat_42 => On => On session.bug_compat_warn => On => On session.cache_expire => 60 => 60 session.cache_limiter => private => private session.cookie_domain => no value => no value session.cookie_lifetime => 3600 => 3600 session.cookie_path => / => / session.cookie_secure => Off => Off session.entropy_file => /dev/urandom => /dev/urandom session.entropy_length => 512 => 512 session.gc_dividend => 100 => 100 session.gc_maxlifetime => 3600 => 3600 session.gc_probability => 1 => 1 session.name => SID => SID session.referer_check => no value => no value session.save_handler => files => files session.save_path => /tmpfs/sessions => /tmpfs/sessions session.serialize_handler => php => php session.use_cookies => Off => Off session.use_only_cookies => Off => Off session.use_trans_sid => Off => Off standard Regex Library => Bundled library enabled Dynamic Library Support => enabled Directive => Local Value => Master Value assert.active => 1 => 1 assert.bail => 0 => 0 assert.callback => no value => no value assert.quiet_eval => 0 => 0 assert.warning => 1 => 1 auto_detect_line_endings => 0 => 0 default_socket_timeout => 60 => 60 safe_mode_allowed_env_vars => PHP_ => PHP_ safe_mode_protected_env_vars => LD_LIBRARY_PATH => LD_LIBRARY_PATH url_rewriter.tags => a=href,area=href,frame=src,form=,fieldset= => a=href,area=href,frame=src,form=,fieldset= user_agent => no value => no value tokenizer Tokenizer Support => enabled xml XML Support => active XML Namespace Support => active EXPAT Version => 1.95.2 Additional Modules Module Name Environment Variable => Value PWD => /usr/src/php-4.3.0RC2 MAKEFLAGS => SCRIPT_FILENAME => MFLAGS => HOSTNAME => d45.westmaster.com LESSOPEN => |/usr/bin/lesspipe.sh %s CC => gcc REQUEST_METHOD => LS_COLORS => no=00:fi=00:di=01;34:ln=01;36:pi=40;33:so=01;35:bd=40;33;01:cd=40;33;01:or=01;05;37;41:mi=01;05;37;41:ex=01;32:*.cmd=01;32:*.exe=01;32:*.com=01;32:*.btm=01;32:*.bat=01;32:*.sh=01;32:*.csh=01;32:*.tar=01;31:*.tgz=01;31:*.arj=01;31:*.taz=01;31:*.lzh=01;31:*.zip=01;31:*.z=01;31:*.Z=01;31:*.gz=01;31:*.bz2=01;31:*.bz=01;31:*.tz=01;31:*.rpm=01;31:*.cpio=01;31:*.jpg=01;35:*.gif=01;35:*.bmp=01;35:*.xbm=01;35:*.xpm=01;35:*.png=01;35:*.tif=01;35: USER => skunk MACHTYPE => i386-redhat-linux-gnu TEST_PHP_SRCDIR => /usr/src/php-4.3.0RC2 MAIL => /var/spool/mail/skunk INPUTRC => /etc/inputrc BASH_ENV => /home/skunk/.bashrc PATH_TRANSLATED => LANG => en_US QUERY_STRING => CONTENT_LENGTH => MAKELEVEL => 1 DISPLAY => localhost:10.0 SHLVL => 4 LOGNAME => skunk REDIRECT_STATUS => _ => /usr/src/php-4.3.0RC2/sapi/cli/php TEST_PHP_EXECUTABLE => /usr/src/php-4.3.0RC2/sapi/cli/php SHELL => /bin/sh HOSTTYPE => i386 HISTSIZE => 1000 OSTYPE => linux-gnu TERM => xterm HOME => /root PATH => /usr/local/bin:/bin:/usr/bin:/usr/X11R6/bin:/home/skunk/bin SSH_TTY => /dev/pts/0 CONTENT_TYPE => PHP Variables Variable => Value PHP_SELF => _SERVER["PWD"] => /usr/src/php-4.3.0RC2 _SERVER["MAKEFLAGS"] => _SERVER["SCRIPT_FILENAME"] => _SERVER["MFLAGS"] => _SERVER["HOSTNAME"] => d45.westmaster.com _SERVER["LESSOPEN"] => |/usr/bin/lesspipe.sh %s _SERVER["CC"] => gcc _SERVER["REQUEST_METHOD"] => _SERVER["LS_COLORS"] => no=00:fi=00:di=01;34:ln=01;36:pi=40;33:so=01;35:bd=40;33;01:cd=40;33;01:or=01;05;37;41:mi=01;05;37;41:ex=01;32:*.cmd=01;32:*.exe=01;32:*.com=01;32:*.btm=01;32:*.bat=01;32:*.sh=01;32:*.csh=01;32:*.tar=01;31:*.tgz=01;31:*.arj=01;31:*.taz=01;31:*.lzh=01;31:*.zip=01;31:*.z=01;31:*.Z=01;31:*.gz=01;31:*.bz2=01;31:*.bz=01;31:*.tz=01;31:*.rpm=01;31:*.cpio=01;31:*.jpg=01;35:*.gif=01;35:*.bmp=01;35:*.xbm=01;35:*.xpm=01;35:*.png=01;35:*.tif=01;35: _SERVER["USER"] => skunk _SERVER["MACHTYPE"] => i386-redhat-linux-gnu _SERVER["TEST_PHP_SRCDIR"] => /usr/src/php-4.3.0RC2 _SERVER["MAIL"] => /var/spool/mail/skunk _SERVER["INPUTRC"] => /etc/inputrc _SERVER["BASH_ENV"] => /home/skunk/.bashrc _SERVER["PATH_TRANSLATED"] => _SERVER["LANG"] => en_US _SERVER["QUERY_STRING"] => _SERVER["CONTENT_LENGTH"] => _SERVER["MAKELEVEL"] => 1 _SERVER["DISPLAY"] => localhost:10.0 _SERVER["SHLVL"] => 4 _SERVER["LOGNAME"] => skunk _SERVER["REDIRECT_STATUS"] => _SERVER["_"] => /usr/src/php-4.3.0RC2/sapi/cli/php _SERVER["TEST_PHP_EXECUTABLE"] => /usr/src/php-4.3.0RC2/sapi/cli/php _SERVER["SHELL"] => /bin/sh _SERVER["HOSTTYPE"] => i386 _SERVER["HISTSIZE"] => 1000 _SERVER["OSTYPE"] => linux-gnu _SERVER["TERM"] => xterm _SERVER["HOME"] => /root _SERVER["PATH"] => /usr/local/bin:/bin:/usr/bin:/usr/X11R6/bin:/home/skunk/bin _SERVER["SSH_TTY"] => /dev/pts/0 _SERVER["CONTENT_TYPE"] => _SERVER["PHP_SELF"] => _SERVER["SCRIPT_NAME"] => _SERVER["DOCUMENT_ROOT"] => _SERVER["argv"] => Array ( ) _SERVER["argc"] => 0 _ENV["PWD"] => /usr/src/php-4.3.0RC2 _ENV["MAKEFLAGS"] => _ENV["SCRIPT_FILENAME"] => _ENV["MFLAGS"] => _ENV["HOSTNAME"] => d45.westmaster.com _ENV["LESSOPEN"] => |/usr/bin/lesspipe.sh %s _ENV["CC"] => gcc _ENV["REQUEST_METHOD"] => _ENV["LS_COLORS"] => no=00:fi=00:di=01;34:ln=01;36:pi=40;33:so=01;35:bd=40;33;01:cd=40;33;01:or=01;05;37;41:mi=01;05;37;41:ex=01;32:*.cmd=01;32:*.exe=01;32:*.com=01;32:*.btm=01;32:*.bat=01;32:*.sh=01;32:*.csh=01;32:*.tar=01;31:*.tgz=01;31:*.arj=01;31:*.taz=01;31:*.lzh=01;31:*.zip=01;31:*.z=01;31:*.Z=01;31:*.gz=01;31:*.bz2=01;31:*.bz=01;31:*.tz=01;31:*.rpm=01;31:*.cpio=01;31:*.jpg=01;35:*.gif=01;35:*.bmp=01;35:*.xbm=01;35:*.xpm=01;35:*.png=01;35:*.tif=01;35: _ENV["USER"] => skunk _ENV["MACHTYPE"] => i386-redhat-linux-gnu _ENV["TEST_PHP_SRCDIR"] => /usr/src/php-4.3.0RC2 _ENV["MAIL"] => /var/spool/mail/skunk _ENV["INPUTRC"] => /etc/inputrc _ENV["BASH_ENV"] => /home/skunk/.bashrc _ENV["PATH_TRANSLATED"] => _ENV["LANG"] => en_US _ENV["QUERY_STRING"] => _ENV["CONTENT_LENGTH"] => _ENV["MAKELEVEL"] => 1 _ENV["DISPLAY"] => localhost:10.0 _ENV["SHLVL"] => 4 _ENV["LOGNAME"] => skunk _ENV["REDIRECT_STATUS"] => _ENV["_"] => /usr/src/php-4.3.0RC2/sapi/cli/php _ENV["TEST_PHP_EXECUTABLE"] => /usr/src/php-4.3.0RC2/sapi/cli/php _ENV["SHELL"] => /bin/sh _ENV["HOSTTYPE"] => i386 _ENV["HISTSIZE"] => 1000 _ENV["OSTYPE"] => linux-gnu _ENV["TERM"] => xterm _ENV["HOME"] => /root _ENV["PATH"] => /usr/local/bin:/bin:/usr/bin:/usr/X11R6/bin:/home/skunk/bin _ENV["SSH_TTY"] => /dev/pts/0 _ENV["CONTENT_TYPE"] => PHP License This program is free software; you can redistribute it and/or modify it under the terms of the PHP License as published by the PHP Group and included in the distribution in the file: LICENSE This program is distributed in the hope that it will be useful, but WITHOUT ANY WARRANTY; without even the implied warranty of MERCHANTABILITY or FITNESS FOR A PARTICULAR PURPOSE. If you did not receive a copy of the PHP license, or have any questions about PHP licensing, please contact license@php.net.

« previous php.qa (#7147) next »