Test results [failed]

From: Date: Sat, 11 Jan 2003 17:02:33 +0000
Subject: Test results [failed]
Groups: php.qa 
Request: Send a blank email to php-qa+get-7966@lists.php.net to get a copy of this message
===================================================================== FAILED TEST SUMMARY --------------------------------------------------------------------- Bug #20539 (PHP CLI Segmentation Fault) [tests/basic/bug20539.phpt] session object serialization [ext/session/tests/001.phpt] session object deserialization [ext/session/tests/003.phpt] correct instantiation of references between variables in sessions [ext/session/tests/006.phpt] bug compatibility: unset($c) with enabled register_globals [ext/session/tests/007.phpt] bug compatibility: global is used albeit register_globals=0 [ext/session/tests/008-php4.2.3.phpt] unset($_SESSION["name"]); should work with register_globals=off [ext/session/tests/009.phpt] registering $_SESSION should not segfault [ext/session/tests/012.phpt] redefining SID should not cause warnings [ext/session/tests/013.phpt] a script should not be able to modify session.use_trans_sid [ext/session/tests/014.phpt] use_trans_sid should not affect SID [ext/session/tests/015.phpt] setting $_SESSION before session_start() should not cause segfault [ext/session/tests/017.phpt] rewriter correctly handles attribute names which contain dashes [ext/session/tests/018.phpt] serializing references test case using globals [ext/session/tests/019.phpt] rewriter uses arg_seperator.output for modifying URLs [ext/session/tests/020.phpt] rewriter handles form and fieldset tags correctly [ext/session/tests/021.phpt] ===================================================================== ===================================================================== TEST RESULT SUMMARY --------------------------------------------------------------------- Exts skipped : 71 Exts tested : 17 --------------------------------------------------------------------- Number of tests : 443 Tests skipped : 199 (44.9%) Tests failed : 16 ( 3.6%) Tests passed : 228 (51.5%) --------------------------------------------------------------------- Time taken : 195 seconds ===================================================================== ================================================================================ /usr/local/src/www/php-4.3.0/tests/basic/bug20539.phpt ================================================================================ ---- EXPECTED OUTPUT good :) ---- ACTUAL OUTPUT good :) Warning: Unknown(): open(/tmp/php/sess_14a48032d7d5e995f1d4fd79c564ea18, O_RDWR) failed: No such file or directory (2) in Unknown on line 0 Warning: Unknown(): Failed to write session data (files). Please verify that the current setting of session.save_path is correct (/tmp/php) in Unknown on line 0 ---- FAILED ================================================================================ 002+ 003+ Warning: Unknown(): open(/tmp/php/sess_14a48032d7d5e995f1d4fd79c564ea18, O_RDWR) failed: No such file or directory (2) in Unknown on line 0 004+ 005+ Warning: Unknown(): Failed to write session data (files). Please verify that the current setting of session.save_path is correct (/tmp/php) in Unknown on line 0 ================================================================================ ================================================================================ /usr/local/src/www/php-4.3.0/ext/session/tests/001.phpt ================================================================================ ---- EXPECTED OUTPUT baz|O:3:"foo":2:{s:3:"bar";s:2:"ok";s:3:"yes";s:4:"done";}arr|a:1:{i:3;O:3:"foo":2:{s:3:"bar";s:2:"ok";s:3:"yes";s:4:"done";}} ---- ACTUAL OUTPUT Warning: session_register() [/phpmanual/function.session-register.html]: open(/tmp/php/sess_8071c792fbac802c0c50e5f232a38b1e, O_RDWR) failed: No such file or directory (2) in /usr/local/src/www/php-4.3.0/ext/session/tests/001.php on line 16 baz|O:3:"foo":2:{s:3:"bar";s:2:"ok";s:3:"yes";s:4:"done";}arr|a:1:{i:3;O:3:"foo":2:{s:3:"bar";s:2:"ok";s:3:"yes";s:4:"done";}} Warning: session_destroy() [/phpmanual/function.session-destroy.html]: Session object destruction failed in /usr/local/src/www/php-4.3.0/ext/session/tests/001.php on line 21 ---- FAILED ================================================================================ 001- baz|O:3:"foo":2:{s:3:"bar";s:2:"ok";s:3:"yes";s:4:"done";}arr|a:1:{i:3;O:3:"foo":2:{s:3:"bar";s:2:"ok";s:3:"yes";s:4:"done";}} 001+ Warning: session_register() [/phpmanual/function.session-register.html]: open(/tmp/php/sess_8071c792fbac802c0c50e5f232a38b1e, O_RDWR) failed: No such file or directory (2) in /usr/local/src/www/php-4.3.0/ext/session/tests/001.php on line 16 002+ baz|O:3:"foo":2:{s:3:"bar";s:2:"ok";s:3:"yes";s:4:"done";}arr|a:1:{i:3;O:3:"foo":2:{s:3:"bar";s:2:"ok";s:3:"yes";s:4:"done";}} 003+ 004+ Warning: session_destroy() [/phpmanual/function.session-destroy.html]: Session object destruction failed in /usr/local/src/www/php-4.3.0/ext/session/tests/001.php on line 21 ================================================================================ ================================================================================ /usr/local/src/www/php-4.3.0/ext/session/tests/003.phpt ================================================================================ ---- EXPECTED OUTPUT object(foo)(2) { ["bar"]=> string(2) "ok" ["yes"]=> int(2) } array(1) { [3]=> &object(foo)(2) { ["bar"]=> string(2) "ok" ["yes"]=> int(2) } } ---- ACTUAL OUTPUT Warning: session_start() [/phpmanual/function.session-start.html]: open(/tmp/php/sess_abtest, O_RDWR) failed: No such file or directory (2) in /usr/local/src/www/php-4.3.0/ext/session/tests/003.php on line 10 object(foo)(2) { ["bar"]=> string(2) "ok" ["yes"]=> int(2) } array(1) { [3]=> &object(foo)(2) { ["bar"]=> string(2) "ok" ["yes"]=> int(2) } } Warning: session_destroy() [/phpmanual/function.session-destroy.html]: Session object destruction failed in /usr/local/src/www/php-4.3.0/ext/session/tests/003.php on line 18 ---- FAILED ================================================================================ 001- object(foo)(2) { 001+ Warning: session_start() [/phpmanual/function.session-start.html]: open(/tmp/php/sess_abtest, O_RDWR) failed: No such file or directory (2) in /usr/local/src/www/php-4.3.0/ext/session/tests/003.php on line 10 002- ["bar"]=> 002+ object(foo)(2) { 003- string(2) "ok" 003+ ["bar"]=> 004- ["yes"]=> 004+ string(2) "ok" 005- int(2) 005+ ["yes"]=> 006- } 006+ int(2) 007- array(1) { 007+ } 008- [3]=> 008+ array(1) { 009- &object(foo)(2) { 009+ [3]=> 010- ["bar"]=> 010+ &object(foo)(2) { 011- string(2) "ok" 011+ ["bar"]=> 012- ["yes"]=> 012+ string(2) "ok" 013- int(2) 013+ ["yes"]=> 014- } 014+ int(2) 015- } 015+ } 016+ } 017+ 018+ Warning: session_destroy() [/phpmanual/function.session-destroy.html]: Session object destruction failed in /usr/local/src/www/php-4.3.0/ext/session/tests/003.php on line 18 ================================================================================ ================================================================================ /usr/local/src/www/php-4.3.0/ext/session/tests/006.phpt ================================================================================ ---- EXPECTED OUTPUT original values: object(a)(1) { ["test"]=> string(5) "hallo" } object(b)(1) { ["a"]=> &object(a)(1) { ["test"]=> string(5) "hallo" } } values after session: object(a)(1) { ["test"]=> string(5) "hallo" } object(b)(1) { ["a"]=> &object(a)(1) { ["test"]=> string(5) "hallo" } } ---- ACTUAL OUTPUT Warning: session_start() [/phpmanual/function.session-start.html]: open(/tmp/php/sess_abtest, O_RDWR) failed: No such file or directory (2) in /usr/local/src/www/php-4.3.0/ext/session/tests/006.php on line 5 original values: object(a)(1) { ["test"]=> string(5) "hallo" } object(b)(1) { ["a"]=> &object(a)(1) { ["test"]=> string(5) "hallo" } } Warning: session_write_close() [/phpmanual/function.session-write-close.html]: open(/tmp/php/sess_abtest, O_RDWR) failed: No such file or directory (2) in /usr/local/src/www/php-4.3.0/ext/session/tests/006.php on line 26 Warning: session_write_close() [/phpmanual/function.session-write-close.html]: Failed to write session data (files). Please verify that the current setting of session.save_path is correct (/tmp/php) in /usr/local/src/www/php-4.3.0/ext/session/tests/006.php on line 26 Warning: session_start() [/phpmanual/function.session-start.html]: open(/tmp/php/sess_abtest, O_RDWR) failed: No such file or directory (2) in /usr/local/src/www/php-4.3.0/ext/session/tests/006.php on line 31 values after session: object(a)(1) { ["test"]=> string(5) "hallo" } object(b)(1) { ["a"]=> &object(a)(1) { ["test"]=> string(5) "hallo" } } Warning: Unknown(): open(/tmp/php/sess_abtest, O_RDWR) failed: No such file or directory (2) in Unknown on line 0 Warning: Unknown(): Failed to write session data (files). Please verify that the current setting of session.save_path is correct (/tmp/php) in Unknown on line 0 ---- FAILED ================================================================================ 001- original values: 001+ Warning: session_start() [/phpmanual/function.session-start.html]: open(/tmp/php/sess_abtest, O_RDWR) failed: No such file or directory (2) in /usr/local/src/www/php-4.3.0/ext/session/tests/006.php on line 5 002- object(a)(1) { 002+ original values: 003- ["test"]=> 003+ object(a)(1) { 004- string(5) "hallo" 004+ ["test"]=> 005- } 005+ string(5) "hallo" 006- object(b)(1) { 006+ } 007- ["a"]=> 007+ object(b)(1) { 008- &object(a)(1) { 008+ ["a"]=> 009- ["test"]=> 009+ &object(a)(1) { 010- string(5) "hallo" 010+ ["test"]=> 011- } 011+ string(5) "hallo" 012- } 012+ } 013- values after session: 013+ } 014- object(a)(1) { 014+ 015- ["test"]=> 015+ Warning: session_write_close() [/phpmanual/function.session-write-close.html]: open(/tmp/php/sess_abtest, O_RDWR) failed: No such file or directory (2) in /usr/local/src/www/php-4.3.0/ext/session/tests/006.php on line 26 016- string(5) "hallo" 016+ 017- } 017+ Warning: session_write_close() [/phpmanual/function.session-write-close.html]: Failed to write session data (files). Please verify that the current setting of session.save_path is correct (/tmp/php) in /usr/local/src/www/php-4.3.0/ext/session/tests/006.php on line 26 018- object(b)(1) { 018+ 019- ["a"]=> 019+ Warning: session_start() [/phpmanual/function.session-start.html]: open(/tmp/php/sess_abtest, O_RDWR) failed: No such file or directory (2) in /usr/local/src/www/php-4.3.0/ext/session/tests/006.php on line 31 020- &object(a)(1) { 020+ values after session: 021- ["test"]=> 021+ object(a)(1) { 022- string(5) "hallo" 022+ ["test"]=> 023- } 023+ string(5) "hallo" 025+ object(b)(1) { 026+ ["a"]=> 027+ &object(a)(1) { 028+ ["test"]=> 029+ string(5) "hallo" 030+ } 031+ } 032+ 033+ Warning: Unknown(): open(/tmp/php/sess_abtest, O_RDWR) failed: No such file or directory (2) in Unknown on line 0 034+ 035+ Warning: Unknown(): Failed to write session data (files). Please verify that the current setting of session.save_path is correct (/tmp/php) in Unknown on line 0 ================================================================================ ================================================================================ /usr/local/src/www/php-4.3.0/ext/session/tests/007.phpt ================================================================================ ---- EXPECTED OUTPUT float(3.14) array(1) { ["c"]=> &float(3.14) } float(3.14) array(1) { ["c"]=> &float(3.14) } ---- ACTUAL OUTPUT Warning: session_start() [/phpmanual/function.session-start.html]: open(/tmp/php/sess_abtest, O_RDWR) failed: No such file or directory (2) in /usr/local/src/www/php-4.3.0/ext/session/tests/007.php on line 7 Warning: session_destroy() [/phpmanual/function.session-destroy.html]: Session object destruction failed in /usr/local/src/www/php-4.3.0/ext/session/tests/007.php on line 8 Warning: session_register() [/phpmanual/function.session-register.html]: open(/tmp/php/sess_abtest, O_RDWR) failed: No such file or directory (2) in /usr/local/src/www/php-4.3.0/ext/session/tests/007.php on line 12 Warning: session_write_close() [/phpmanual/function.session-write-close.html]: open(/tmp/php/sess_abtest, O_RDWR) failed: No such file or directory (2) in /usr/local/src/www/php-4.3.0/ext/session/tests/007.php on line 15 Warning: session_write_close() [/phpmanual/function.session-write-close.html]: Failed to write session data (files). Please verify that the current setting of session.save_path is correct (/tmp/php) in /usr/local/src/www/php-4.3.0/ext/session/tests/007.php on line 15 Warning: session_start() [/phpmanual/function.session-start.html]: open(/tmp/php/sess_abtest, O_RDWR) failed: No such file or directory (2) in /usr/local/src/www/php-4.3.0/ext/session/tests/007.php on line 20 Notice: Undefined variable: c in /usr/local/src/www/php-4.3.0/ext/session/tests/007.php on line 21 NULL array(0) { } Warning: session_write_close() [/phpmanual/function.session-write-close.html]: open(/tmp/php/sess_abtest, O_RDWR) failed: No such file or directory (2) in /usr/local/src/www/php-4.3.0/ext/session/tests/007.php on line 26 Warning: session_write_close() [/phpmanual/function.session-write-close.html]: Failed to write session data (files). Please verify that the current setting of session.save_path is correct (/tmp/php) in /usr/local/src/www/php-4.3.0/ext/session/tests/007.php on line 26 Warning: session_start() [/phpmanual/function.session-start.html]: open(/tmp/php/sess_abtest, O_RDWR) failed: No such file or directory (2) in /usr/local/src/www/php-4.3.0/ext/session/tests/007.php on line 32 Notice: Undefined variable: c in /usr/local/src/www/php-4.3.0/ext/session/tests/007.php on line 33 NULL array(0) { } Warning: session_destroy() [/phpmanual/function.session-destroy.html]: Session object destruction failed in /usr/local/src/www/php-4.3.0/ext/session/tests/007.php on line 36 ---- FAILED ================================================================================ 001- float(3.14) 001+ Warning: session_start() [/phpmanual/function.session-start.html]: open(/tmp/php/sess_abtest, O_RDWR) failed: No such file or directory (2) in /usr/local/src/www/php-4.3.0/ext/session/tests/007.php on line 7 002- array(1) { 002+ 003- ["c"]=> 003+ Warning: session_destroy() [/phpmanual/function.session-destroy.html]: Session object destruction failed in /usr/local/src/www/php-4.3.0/ext/session/tests/007.php on line 8 004- &float(3.14) 004+ 005- } 005+ Warning: session_register() [/phpmanual/function.session-register.html]: open(/tmp/php/sess_abtest, O_RDWR) failed: No such file or directory (2) in /usr/local/src/www/php-4.3.0/ext/session/tests/007.php on line 12 006- float(3.14) 006+ 007- array(1) { 007+ Warning: session_write_close() [/phpmanual/function.session-write-close.html]: open(/tmp/php/sess_abtest, O_RDWR) failed: No such file or directory (2) in /usr/local/src/www/php-4.3.0/ext/session/tests/007.php on line 15 008- ["c"]=> 008+ 009- &float(3.14) 009+ Warning: session_write_close() [/phpmanual/function.session-write-close.html]: Failed to write session data (files). Please verify that the current setting of session.save_path is correct (/tmp/php) in /usr/local/src/www/php-4.3.0/ext/session/tests/007.php on line 15 010- } 010+ 011+ Warning: session_start() [/phpmanual/function.session-start.html]: open(/tmp/php/sess_abtest, O_RDWR) failed: No such file or directory (2) in /usr/local/src/www/php-4.3.0/ext/session/tests/007.php on line 20 012+ 013+ Notice: Undefined variable: c in /usr/local/src/www/php-4.3.0/ext/session/tests/007.php on line 21 014+ NULL 015+ array(0) { 016+ } 017+ 018+ Warning: session_write_close() [/phpmanual/function.session-write-close.html]: open(/tmp/php/sess_abtest, O_RDWR) failed: No such file or directory (2) in /usr/local/src/www/php-4.3.0/ext/session/tests/007.php on line 26 019+ 020+ Warning: session_write_close() [/phpmanual/function.session-write-close.html]: Failed to write session data (files). Please verify that the current setting of session.save_path is correct (/tmp/php) in /usr/local/src/www/php-4.3.0/ext/session/tests/007.php on line 26 021+ 022+ Warning: session_start() [/phpmanual/function.session-start.html]: open(/tmp/php/sess_abtest, O_RDWR) failed: No such file or directory (2) in /usr/local/src/www/php-4.3.0/ext/session/tests/007.php on line 32 023+ 024+ Notice: Undefined variable: c in /usr/local/src/www/php-4.3.0/ext/session/tests/007.php on line 33 025+ NULL 026+ array(0) { 027+ } 028+ 029+ Warning: session_destroy() [/phpmanual/function.session-destroy.html]: Session object destruction failed in /usr/local/src/www/php-4.3.0/ext/session/tests/007.php on line 36 ================================================================================ ================================================================================ /usr/local/src/www/php-4.3.0/ext/session/tests/008-php4.2.3.phpt ================================================================================ ---- EXPECTED OUTPUT NULL Your script possibly relies on a session side-effect which existed until PHP 4.2.3. Please be advised that the session extension does not consider global variables as a source of data, unless register_globals is enabled. You can disable this functionality and this warning by setting session.bug_compat_42 or session.bug_compat_warn to off, respectively. array(1) { ["c"]=> float(3.14) } NULL array(1) { ["c"]=> float(3.14) } ---- ACTUAL OUTPUT Warning: session_start() [/phpmanual/function.session-start.html]: open(/tmp/php/sess_abtest, O_RDWR) failed: No such file or directory (2) in /usr/local/src/www/php-4.3.0/ext/session/tests/008-php4.2.3.php on line 5 Warning: session_destroy() [/phpmanual/function.session-destroy.html]: Session object destruction failed in /usr/local/src/www/php-4.3.0/ext/session/tests/008-php4.2.3.php on line 6 Warning: session_register() [/phpmanual/function.session-register.html]: open(/tmp/php/sess_abtest, O_RDWR) failed: No such file or directory (2) in /usr/local/src/www/php-4.3.0/ext/session/tests/008-php4.2.3.php on line 10 NULL Failed to write session data (files). Please verify that the current setting of session.save_path is correct (/tmp/php) Warning: session_start() [/phpmanual/function.session-start.html]: open(/tmp/php/sess_abtest, O_RDWR) failed: No such file or directory (2) in /usr/local/src/www/php-4.3.0/ext/session/tests/008-php4.2.3.php on line 21 array(0) { } Warning: session_write_close() [/phpmanual/function.session-write-close.html]: open(/tmp/php/sess_abtest, O_RDWR) failed: No such file or directory (2) in /usr/local/src/www/php-4.3.0/ext/session/tests/008-php4.2.3.php on line 26 Warning: session_write_close() [/phpmanual/function.session-write-close.html]: Failed to write session data (files). Please verify that the current setting of session.save_path is correct (/tmp/php) in /usr/local/src/www/php-4.3.0/ext/session/tests/008-php4.2.3.php on line 26 Warning: session_start() [/phpmanual/function.session-start.html]: open(/tmp/php/sess_abtest, O_RDWR) failed: No such file or directory (2) in /usr/local/src/www/php-4.3.0/ext/session/tests/008-php4.2.3.php on line 32 NULL array(0) { } Warning: session_destroy() [/phpmanual/function.session-destroy.html]: Session object destruction failed in /usr/local/src/www/php-4.3.0/ext/session/tests/008-php4.2.3.php on line 36 ---- FAILED ================================================================================ 001- NULL 001+ Warning: session_start() [/phpmanual/function.session-start.html]: open(/tmp/php/sess_abtest, O_RDWR) failed: No such file or directory (2) in /usr/local/src/www/php-4.3.0/ext/session/tests/008-php4.2.3.php on line 5 002- Your script possibly relies on a session side-effect which existed until PHP 4.2.3. Please be advised that the session extension does not consider global variables as a source of data, unless register_globals is enabled. You can disable this functionality and this warning by setting session.bug_compat_42 or session.bug_compat_warn to off, respectively. 002+ 003- array(1) { 003+ Warning: session_destroy() [/phpmanual/function.session-destroy.html]: Session object destruction failed in /usr/local/src/www/php-4.3.0/ext/session/tests/008-php4.2.3.php on line 6 004- ["c"]=> 004+ 005- float(3.14) 005+ Warning: session_register() [/phpmanual/function.session-register.html]: open(/tmp/php/sess_abtest, O_RDWR) failed: No such file or directory (2) in /usr/local/src/www/php-4.3.0/ext/session/tests/008-php4.2.3.php on line 10 006- } 006+ NULL 007- NULL 007+ Failed to write session data (files). Please verify that the current setting of session.save_path is correct (/tmp/php) 008- array(1) { 008+ 009- ["c"]=> 009+ Warning: session_start() [/phpmanual/function.session-start.html]: open(/tmp/php/sess_abtest, O_RDWR) failed: No such file or directory (2) in /usr/local/src/www/php-4.3.0/ext/session/tests/008-php4.2.3.php on line 21 010- float(3.14) 010+ array(0) { 012+ 013+ Warning: session_write_close() [/phpmanual/function.session-write-close.html]: open(/tmp/php/sess_abtest, O_RDWR) failed: No such file or directory (2) in /usr/local/src/www/php-4.3.0/ext/session/tests/008-php4.2.3.php on line 26 014+ 015+ Warning: session_write_close() [/phpmanual/function.session-write-close.html]: Failed to write session data (files). Please verify that the current setting of session.save_path is correct (/tmp/php) in /usr/local/src/www/php-4.3.0/ext/session/tests/008-php4.2.3.php on line 26 016+ 017+ Warning: session_start() [/phpmanual/function.session-start.html]: open(/tmp/php/sess_abtest, O_RDWR) failed: No such file or directory (2) in /usr/local/src/www/php-4.3.0/ext/session/tests/008-php4.2.3.php on line 32 018+ NULL 019+ array(0) { 020+ } 021+ 022+ Warning: session_destroy() [/phpmanual/function.session-destroy.html]: Session object destruction failed in /usr/local/src/www/php-4.3.0/ext/session/tests/008-php4.2.3.php on line 36 ================================================================================ ================================================================================ /usr/local/src/www/php-4.3.0/ext/session/tests/009.phpt ================================================================================ ---- EXPECTED OUTPUT array(0) { } array(1) { ["name"]=> string(3) "foo" } array(1) { ["name"]=> string(3) "foo" } array(0) { } array(0) { } ---- ACTUAL OUTPUT Warning: session_start() [/phpmanual/function.session-start.html]: open(/tmp/php/sess_abtest, O_RDWR) failed: No such file or directory (2) in /usr/local/src/www/php-4.3.0/ext/session/tests/009.php on line 7 Warning: session_destroy() [/phpmanual/function.session-destroy.html]: Session object destruction failed in /usr/local/src/www/php-4.3.0/ext/session/tests/009.php on line 8 Warning: session_start() [/phpmanual/function.session-start.html]: open(/tmp/php/sess_abtest, O_RDWR) failed: No such file or directory (2) in /usr/local/src/www/php-4.3.0/ext/session/tests/009.php on line 12 array(0) { } array(1) { ["name"]=> string(3) "foo" } Warning: session_write_close() [/phpmanual/function.session-write-close.html]: open(/tmp/php/sess_abtest, O_RDWR) failed: No such file or directory (2) in /usr/local/src/www/php-4.3.0/ext/session/tests/009.php on line 16 Warning: session_write_close() [/phpmanual/function.session-write-close.html]: Failed to write session data (files). Please verify that the current setting of session.save_path is correct (/tmp/php) in /usr/local/src/www/php-4.3.0/ext/session/tests/009.php on line 16 Warning: session_start() [/phpmanual/function.session-start.html]: open(/tmp/php/sess_abtest, O_RDWR) failed: No such file or directory (2) in /usr/local/src/www/php-4.3.0/ext/session/tests/009.php on line 19 array(0) { } array(0) { } Warning: session_write_close() [/phpmanual/function.session-write-close.html]: open(/tmp/php/sess_abtest, O_RDWR) failed: No such file or directory (2) in /usr/local/src/www/php-4.3.0/ext/session/tests/009.php on line 23 Warning: session_write_close() [/phpmanual/function.session-write-close.html]: Failed to write session data (files). Please verify that the current setting of session.save_path is correct (/tmp/php) in /usr/local/src/www/php-4.3.0/ext/session/tests/009.php on line 23 Warning: session_start() [/phpmanual/function.session-start.html]: open(/tmp/php/sess_abtest, O_RDWR) failed: No such file or directory (2) in /usr/local/src/www/php-4.3.0/ext/session/tests/009.php on line 27 array(0) { } Warning: session_destroy() [/phpmanual/function.session-destroy.html]: Session object destruction failed in /usr/local/src/www/php-4.3.0/ext/session/tests/009.php on line 29 ---- FAILED ================================================================================ 001- array(0) { 001+ Warning: session_start() [/phpmanual/function.session-start.html]: open(/tmp/php/sess_abtest, O_RDWR) failed: No such file or directory (2) in /usr/local/src/www/php-4.3.0/ext/session/tests/009.php on line 7 002- } 002+ 003- array(1) { 003+ Warning: session_destroy() [/phpmanual/function.session-destroy.html]: Session object destruction failed in /usr/local/src/www/php-4.3.0/ext/session/tests/009.php on line 8 004- ["name"]=> 004+ 005- string(3) "foo" 005+ Warning: session_start() [/phpmanual/function.session-start.html]: open(/tmp/php/sess_abtest, O_RDWR) failed: No such file or directory (2) in /usr/local/src/www/php-4.3.0/ext/session/tests/009.php on line 12 006- } 006+ array(0) { 007- array(1) { 007+ } 008- ["name"]=> 008+ array(1) { 009- string(3) "foo" 009+ ["name"]=> 010- } 010+ string(3) "foo" 011- array(0) { 011+ } 012- } 012+ 013- array(0) { 013+ Warning: session_write_close() [/phpmanual/function.session-write-close.html]: open(/tmp/php/sess_abtest, O_RDWR) failed: No such file or directory (2) in /usr/local/src/www/php-4.3.0/ext/session/tests/009.php on line 16 014- } 014+ 015+ Warning: session_write_close() [/phpmanual/function.session-write-close.html]: Failed to write session data (files). Please verify that the current setting of session.save_path is correct (/tmp/php) in /usr/local/src/www/php-4.3.0/ext/session/tests/009.php on line 16 016+ 017+ Warning: session_start() [/phpmanual/function.session-start.html]: open(/tmp/php/sess_abtest, O_RDWR) failed: No such file or directory (2) in /usr/local/src/www/php-4.3.0/ext/session/tests/009.php on line 19 018+ array(0) { 019+ } 020+ array(0) { 021+ } 022+ 023+ Warning: session_write_close() [/phpmanual/function.session-write-close.html]: open(/tmp/php/sess_abtest, O_RDWR) failed: No such file or directory (2) in /usr/local/src/www/php-4.3.0/ext/session/tests/009.php on line 23 024+ 025+ Warning: session_write_close() [/phpmanual/function.session-write-close.html]: Failed to write session data (files). Please verify that the current setting of session.save_path is correct (/tmp/php) in /usr/local/src/www/php-4.3.0/ext/session/tests/009.php on line 23 026+ 027+ Warning: session_start() [/phpmanual/function.session-start.html]: open(/tmp/php/sess_abtest, O_RDWR) failed: No such file or directory (2) in /usr/local/src/www/php-4.3.0/ext/session/tests/009.php on line 27 028+ array(0) { 029+ } 030+ 031+ Warning: session_destroy() [/phpmanual/function.session-destroy.html]: Session object destruction failed in /usr/local/src/www/php-4.3.0/ext/session/tests/009.php on line 29 ================================================================================ ================================================================================ /usr/local/src/www/php-4.3.0/ext/session/tests/012.phpt ================================================================================ ---- EXPECTED OUTPUT I live ---- ACTUAL OUTPUT Warning: session_start() [/phpmanual/function.session-start.html]: open(/tmp/php/sess_abtest, O_RDWR) failed: No such file or directory (2) in /usr/local/src/www/php-4.3.0/ext/session/tests/012.php on line 7 Warning: session_start() [/phpmanual/function.session-start.html]: open(/tmp/php/sess_abtest, O_RDWR) failed: No such file or directory (2) in /usr/local/src/www/php-4.3.0/ext/session/tests/012.php on line 15 Warning: session_destroy() [/phpmanual/function.session-destroy.html]: Session object destruction failed in /usr/local/src/www/php-4.3.0/ext/session/tests/012.php on line 17 I live ---- FAILED ================================================================================ 001- I live 001+ Warning: session_start() [/phpmanual/function.session-start.html]: open(/tmp/php/sess_abtest, O_RDWR) failed: No such file or directory (2) in /usr/local/src/www/php-4.3.0/ext/session/tests/012.php on line 7 002+ 003+ Warning: session_start() [/phpmanual/function.session-start.html]: open(/tmp/php/sess_abtest, O_RDWR) failed: No such file or directory (2) in /usr/local/src/www/php-4.3.0/ext/session/tests/012.php on line 15 004+ 005+ Warning: session_destroy() [/phpmanual/function.session-destroy.html]: Session object destruction failed in /usr/local/src/www/php-4.3.0/ext/session/tests/012.php on line 17 006+ I live ================================================================================ ================================================================================ /usr/local/src/www/php-4.3.0/ext/session/tests/013.phpt ================================================================================ ---- EXPECTED OUTPUT I live ---- ACTUAL OUTPUT Warning: session_start() [/phpmanual/function.session-start.html]: open(/tmp/php/sess_abtest, O_RDWR) failed: No such file or directory (2) in /usr/local/src/www/php-4.3.0/ext/session/tests/013.php on line 5 Warning: session_destroy() [/phpmanual/function.session-destroy.html]: Session object destruction failed in /usr/local/src/www/php-4.3.0/ext/session/tests/013.php on line 6 Warning: session_start() [/phpmanual/function.session-start.html]: open(/tmp/php/sess_abtest2, O_RDWR) failed: No such file or directory (2) in /usr/local/src/www/php-4.3.0/ext/session/tests/013.php on line 8 Warning: session_destroy() [/phpmanual/function.session-destroy.html]: Session object destruction failed in /usr/local/src/www/php-4.3.0/ext/session/tests/013.php on line 9 I live ---- FAILED ================================================================================ 001- I live 001+ Warning: session_start() [/phpmanual/function.session-start.html]: open(/tmp/php/sess_abtest, O_RDWR) failed: No such file or directory (2) in /usr/local/src/www/php-4.3.0/ext/session/tests/013.php on line 5 002+ 003+ Warning: session_destroy() [/phpmanual/function.session-destroy.html]: Session object destruction failed in /usr/local/src/www/php-4.3.0/ext/session/tests/013.php on line 6 004+ 005+ Warning: session_start() [/phpmanual/function.session-start.html]: open(/tmp/php/sess_abtest2, O_RDWR) failed: No such file or directory (2) in /usr/local/src/www/php-4.3.0/ext/session/tests/013.php on line 8 006+ 007+ Warning: session_destroy() [/phpmanual/function.session-destroy.html]: Session object destruction failed in /usr/local/src/www/php-4.3.0/ext/session/tests/013.php on line 9 008+ I live ================================================================================ ================================================================================ /usr/local/src/www/php-4.3.0/ext/session/tests/014.phpt ================================================================================ ---- EXPECTED OUTPUT <a href="/link?PHPSESSID=abtest"> <a href="/link?PHPSESSID=abtest"> <a href="/link?PHPSESSID=abtest"> ---- ACTUAL OUTPUT Warning: session_start() [/phpmanual/function.session-start.html]: open(/tmp/php/sess_abtest, O_RDWR) failed: No such file or directory (2) in /usr/local/src/www/php-4.3.0/ext/session/tests/014.php on line 5 <a href="/link?PHPSESSID=abtest"> <a href="/link?PHPSESSID=abtest"> <a href="/link?PHPSESSID=abtest"> Warning: session_destroy() [/phpmanual/function.session-destroy.html]: Session object destruction failed in /usr/local/src/www/php-4.3.0/ext/session/tests/014.php on line 18 ---- FAILED ================================================================================ 001- <a href="/link?PHPSESSID=abtest"> 001+ Warning: session_start() [/phpmanual/function.session-start.html]: open(/tmp/php/sess_abtest, O_RDWR) failed: No such file or directory (2) in /usr/local/src/www/php-4.3.0/ext/session/tests/014.php on line 5 004+ <a href="/link?PHPSESSID=abtest"> 005+ 006+ Warning: session_destroy() [/phpmanual/function.session-destroy.html]: Session object destruction failed in /usr/local/src/www/php-4.3.0/ext/session/tests/014.php on line 18 ================================================================================ ================================================================================ /usr/local/src/www/php-4.3.0/ext/session/tests/015.phpt ================================================================================ ---- EXPECTED OUTPUT <a href="/link?PHPSESSID=abtest&PHPSESSID=abtest"> ---- ACTUAL OUTPUT Warning: session_start() [/phpmanual/function.session-start.html]: open(/tmp/php/sess_abtest, O_RDWR) failed: No such file or directory (2) in /usr/local/src/www/php-4.3.0/ext/session/tests/015.php on line 5 <a href="/link?PHPSESSID=abtest&PHPSESSID=abtest"> Warning: session_destroy() [/phpmanual/function.session-destroy.html]: Session object destruction failed in /usr/local/src/www/php-4.3.0/ext/session/tests/015.php on line 9 ---- FAILED ================================================================================ 001- <a href="/link?PHPSESSID=abtest&PHPSESSID=abtest"> 001+ Warning: session_start() [/phpmanual/function.session-start.html]: open(/tmp/php/sess_abtest, O_RDWR) failed: No such file or directory (2) in /usr/local/src/www/php-4.3.0/ext/session/tests/015.php on line 5 002+ <a href="/link?PHPSESSID=abtest&PHPSESSID=abtest"> 003+ 004+ Warning: session_destroy() [/phpmanual/function.session-destroy.html]: Session object destruction failed in /usr/local/src/www/php-4.3.0/ext/session/tests/015.php on line 9 ================================================================================ ================================================================================ /usr/local/src/www/php-4.3.0/ext/session/tests/017.phpt ================================================================================ ---- EXPECTED OUTPUT I live ---- ACTUAL OUTPUT Warning: session_start() [/phpmanual/function.session-start.html]: open(/tmp/php/sess_849eba78e45c8e3486eef793f92ac9fb, O_RDWR) failed: No such file or directory (2) in /usr/local/src/www/php-4.3.0/ext/session/tests/017.php on line 8 I live Warning: Unknown(): open(/tmp/php/sess_849eba78e45c8e3486eef793f92ac9fb, O_RDWR) failed: No such file or directory (2) in Unknown on line 0 Warning: Unknown(): Failed to write session data (files). Please verify that the current setting of session.save_path is correct (/tmp/php) in Unknown on line 0 ---- FAILED ================================================================================ 001- I live 001+ Warning: session_start() [/phpmanual/function.session-start.html]: open(/tmp/php/sess_849eba78e45c8e3486eef793f92ac9fb, O_RDWR) failed: No such file or directory (2) in /usr/local/src/www/php-4.3.0/ext/session/tests/017.php on line 8 002+ I live 003+ 004+ Warning: Unknown(): open(/tmp/php/sess_849eba78e45c8e3486eef793f92ac9fb, O_RDWR) failed: No such file or directory (2) in Unknown on line 0 005+ 006+ Warning: Unknown(): Failed to write session data (files). Please verify that the current setting of session.save_path is correct (/tmp/php) in Unknown on line 0 ================================================================================ ================================================================================ /usr/local/src/www/php-4.3.0/ext/session/tests/018.phpt ================================================================================ ---- EXPECTED OUTPUT <form accept-charset="ISO-8859-15, ISO-8859-1" action=url.php><input type="hidden" name="PHPSESSID" value="abtest" /> ---- ACTUAL OUTPUT Warning: session_start() [/phpmanual/function.session-start.html]: open(/tmp/php/sess_abtest, O_RDWR) failed: No such file or directory (2) in /usr/local/src/www/php-4.3.0/ext/session/tests/018.php on line 6 <form accept-charset="ISO-8859-15, ISO-8859-1" action=url.php><input type="hidden" name="PHPSESSID" value="abtest" /> Warning: session_destroy() [/phpmanual/function.session-destroy.html]: Session object destruction failed in /usr/local/src/www/php-4.3.0/ext/session/tests/018.php on line 10 ---- FAILED ================================================================================ 001- <form accept-charset="ISO-8859-15, ISO-8859-1" action=url.php><input type="hidden" name="PHPSESSID" value="abtest" /> 001+ Warning: session_start() [/phpmanual/function.session-start.html]: open(/tmp/php/sess_abtest, O_RDWR) failed: No such file or directory (2) in /usr/local/src/www/php-4.3.0/ext/session/tests/018.php on line 6 002+ <form accept-charset="ISO-8859-15, ISO-8859-1" action=url.php><input type="hidden" name="PHPSESSID" value="abtest" /> 003+ 004+ Warning: session_destroy() [/phpmanual/function.session-destroy.html]: Session object destruction failed in /usr/local/src/www/php-4.3.0/ext/session/tests/018.php on line 10 ================================================================================ ================================================================================ /usr/local/src/www/php-4.3.0/ext/session/tests/019.phpt ================================================================================ ---- EXPECTED OUTPUT array(2) { ["o1"]=> &object(tfoo)(1) { ["c"]=> int(42) } ["o2"]=> &object(tfoo)(1) { ["c"]=> int(42) } } array(2) { ["o1"]=> &object(tfoo)(1) { ["c"]=> int(44) } ["o2"]=> &object(tfoo)(1) { ["c"]=> int(44) } } ---- ACTUAL OUTPUT Warning: session_register() [/phpmanual/function.session-register.html]: open(/tmp/php/sess_abtest, O_RDWR) failed: No such file or directory (2) in /usr/local/src/www/php-4.3.0/ext/session/tests/019.php on line 16 Warning: session_write_close() [/phpmanual/function.session-write-close.html]: open(/tmp/php/sess_abtest, O_RDWR) failed: No such file or directory (2) in /usr/local/src/www/php-4.3.0/ext/session/tests/019.php on line 22 Warning: session_write_close() [/phpmanual/function.session-write-close.html]: Failed to write session data (files). Please verify that the current setting of session.save_path is correct (/tmp/php) in /usr/local/src/www/php-4.3.0/ext/session/tests/019.php on line 22 Warning: session_start() [/phpmanual/function.session-start.html]: open(/tmp/php/sess_abtest, O_RDWR) failed: No such file or directory (2) in /usr/local/src/www/php-4.3.0/ext/session/tests/019.php on line 27 array(0) { } Fatal error: Call to a member function on a non-object in /usr/local/src/www/php-4.3.0/ext/session/tests/019.php on line 31 Warning: Unknown(): open(/tmp/php/sess_abtest, O_RDWR) failed: No such file or directory (2) in Unknown on line 0 Warning: Unknown(): Failed to write session data (files). Please verify that the current setting of session.save_path is correct (/tmp/php) in Unknown on line 0 ---- FAILED ================================================================================ 001- array(2) { 001+ Warning: session_register() [/phpmanual/function.session-register.html]: open(/tmp/php/sess_abtest, O_RDWR) failed: No such file or directory (2) in /usr/local/src/www/php-4.3.0/ext/session/tests/019.php on line 16 002- ["o1"]=> 002+ 003- &object(tfoo)(1) { 003+ Warning: session_write_close() [/phpmanual/function.session-write-close.html]: open(/tmp/php/sess_abtest, O_RDWR) failed: No such file or directory (2) in /usr/local/src/www/php-4.3.0/ext/session/tests/019.php on line 22 004- ["c"]=> 004+ 005- int(42) 005+ Warning: session_write_close() [/phpmanual/function.session-write-close.html]: Failed to write session data (files). Please verify that the current setting of session.save_path is correct (/tmp/php) in /usr/local/src/www/php-4.3.0/ext/session/tests/019.php on line 22 006- } 006+ 007- ["o2"]=> 007+ Warning: session_start() [/phpmanual/function.session-start.html]: open(/tmp/php/sess_abtest, O_RDWR) failed: No such file or directory (2) in /usr/local/src/www/php-4.3.0/ext/session/tests/019.php on line 27 008- &object(tfoo)(1) { 008+ array(0) { 009- ["c"]=> 009+ } 010- int(42) 010+ 011- } 011+ Fatal error: Call to a member function on a non-object in /usr/local/src/www/php-4.3.0/ext/session/tests/019.php on line 31 012- } 012+ 013- array(2) { 013+ Warning: Unknown(): open(/tmp/php/sess_abtest, O_RDWR) failed: No such file or directory (2) in Unknown on line 0 014- ["o1"]=> 014+ 015- &object(tfoo)(1) { 015+ Warning: Unknown(): Failed to write session data (files). Please verify that the current setting of session.save_path is correct (/tmp/php) in Unknown on line 0 016- ["c"]=> 017- int(44) 018- } 019- ["o2"]=> 020- &object(tfoo)(1) { 021- ["c"]=> 022- int(44) 023- } 024- } ================================================================================ ================================================================================ /usr/local/src/www/php-4.3.0/ext/session/tests/020.phpt ================================================================================ ---- EXPECTED OUTPUT <a href="link.php?a=b&amp;PHPSESSID=abtest"> ---- ACTUAL OUTPUT Warning: session_start() [/phpmanual/function.session-start.html]: open(/tmp/php/sess_abtest, O_RDWR) failed: No such file or directory (2) in /usr/local/src/www/php-4.3.0/ext/session/tests/020.php on line 6 <a href="link.php?a=b&amp;PHPSESSID=abtest"> Warning: session_destroy() [/phpmanual/function.session-destroy.html]: Session object destruction failed in /usr/local/src/www/php-4.3.0/ext/session/tests/020.php on line 10 ---- FAILED ================================================================================ 001- <a href="link.php?a=b&amp;PHPSESSID=abtest"> 001+ Warning: session_start() [/phpmanual/function.session-start.html]: open(/tmp/php/sess_abtest, O_RDWR) failed: No such file or directory (2) in /usr/local/src/www/php-4.3.0/ext/session/tests/020.php on line 6 002+ <a href="link.php?a=b&amp;PHPSESSID=abtest"> 003+ 004+ Warning: session_destroy() [/phpmanual/function.session-destroy.html]: Session object destruction failed in /usr/local/src/www/php-4.3.0/ext/session/tests/020.php on line 10 ================================================================================ ================================================================================ /usr/local/src/www/php-4.3.0/ext/session/tests/021.phpt ================================================================================ ---- EXPECTED OUTPUT <form><input type="hidden" name="PHPSESSID" value="abtest" /> <fieldset><input type="hidden" name="PHPSESSID" value="abtest" /> <form><input type="hidden" name="PHPSESSID" value="abtest" /> <fieldset> <form><input type="hidden" name="PHPSESSID" value="abtest" /> <fieldset> <form> <fieldset><input type="hidden" name="PHPSESSID" value="abtest" /> ---- ACTUAL OUTPUT Warning: session_start() [/phpmanual/function.session-start.html]: open(/tmp/php/sess_abtest, O_RDWR) failed: No such file or directory (2) in /usr/local/src/www/php-4.3.0/ext/session/tests/021.php on line 6 <form><input type="hidden" name="PHPSESSID" value="abtest" /> <fieldset><input type="hidden" name="PHPSESSID" value="abtest" /> <form><input type="hidden" name="PHPSESSID" value="abtest" /> <fieldset> <form><input type="hidden" name="PHPSESSID" value="abtest" /> <fieldset> <form> <fieldset><input type="hidden" name="PHPSESSID" value="abtest" /> Warning: session_destroy() [/phpmanual/function.session-destroy.html]: Session object destruction failed in /usr/local/src/www/php-4.3.0/ext/session/tests/021.php on line 39 ---- FAILED ================================================================================ 001- <form><input type="hidden" name="PHPSESSID" value="abtest" /> 001+ Warning: session_start() [/phpmanual/function.session-start.html]: open(/tmp/php/sess_abtest, O_RDWR) failed: No such file or directory (2) in /usr/local/src/www/php-4.3.0/ext/session/tests/021.php on line 6 002- <fieldset><input type="hidden" name="PHPSESSID" value="abtest" /> 002+ <form><input type="hidden" name="PHPSESSID" value="abtest" /> 003- <form><input type="hidden" name="PHPSESSID" value="abtest" /> 003+ <fieldset><input type="hidden" name="PHPSESSID" value="abtest" /> 004- <fieldset> 004+ <form><input type="hidden" name="PHPSESSID" value="abtest" /> 005- <form><input type="hidden" name="PHPSESSID" value="abtest" /> 005+ <fieldset> 006- <fieldset> 006+ <form><input type="hidden" name="PHPSESSID" value="abtest" /> 007- <form> 007+ <fieldset> 008- <fieldset><input type="hidden" name="PHPSESSID" value="abtest" /> 008+ <form> 009+ <fieldset><input type="hidden" name="PHPSESSID" value="abtest" /> 010+ 011+ Warning: session_destroy() [/phpmanual/function.session-destroy.html]: Session object destruction failed in /usr/local/src/www/php-4.3.0/ext/session/tests/021.php on line 39 ================================================================================ ================================================================================ BUILD ENVIRONMENT ================================================================================ OS: Linux Automake: automake (GNU automake) 1.4 Copyright (C) 1999 Free Software Foundation, Inc. This is free software; see the source for copying conditions. There is NO warranty; not even for MERCHANTABILITY or FITNESS FOR A PARTICULAR PURPOSE. Written by Tom Tromey <tromey@cygnus.com> Autoconf: Autoconf version 2.13 Libtool: ltmain.sh (GNU libtool) 1.4.2 (1.922.2.53 2001/09/11 03:18:52) Compiler: Reading specs from /usr/lib/gcc-lib/i386-slackware-linux/egcs-2.91.66/specs gcc version egcs-2.91.66 19990314/Linux (egcs-1.1.2 release) Bison: GNU Bison version 1.27 User's E-mail: ================================================================================ PHPINFO ================================================================================ phpinfo() PHP Version => 4.3.0 System => Linux oodako 2.2.22 #2 Thu Dec 19 09:06:48 CST 2002 i586 Build Date => Jan 11 2003 10:47:54 Configure Command => './configure' '--with-mysql=/usr/local/mysql' '--with-apxs=/usr/local/apache/bin/apxs' '--with-mod_charset' '--enable-track-vars' '--with-openssl' '--enable-bcmath' '--enable-calendar' '--with-curl' '--enable-ftp' '--with-zlib' '--with-xml' '--with-gd' '--with-png-dir=/usr/local' '--with-freetype-dir=/usr/local' '--with-jpeg-dir=/usr' '--with-ttf' '--with-gdbm' '--with-ndbm' Server API => Command Line Interface Virtual Directory Support => disabled Configuration File (php.ini) Path => /usr/local/lib/php.ini PHP API => 20020918 PHP Extension => 20020429 Zend Extension => 20021010 Debug Build => no Thread Safety => disabled Registered PHP Streams => php, http, ftp, https, ftps, compress.zlib This program makes use of the Zend Scripting Language Engine: Zend Engine v1.3.0, Copyright (c) 1998-2002 Zend Technologies _______________________________________________________________________ Configuration PHP Core Directive => Local Value => Master Value allow_call_time_pass_reference => On => On allow_url_fopen => On => On always_populate_raw_post_data => Off => Off arg_separator.input => &amp; => &amp; arg_separator.output => &amp; => &amp; asp_tags => Off => Off auto_append_file => no value => no value auto_prepend_file => no value => no value browscap => no value => no value default_charset => no value => no value default_mimetype => text/html => text/html define_syslog_variables => Off => Off disable_functions => no value => no value display_errors => On => On display_startup_errors => Off => Off doc_root => /www => /www docref_ext => no value => no value docref_root => http://www.php.net/ => http://www.php.net/ enable_dl => On => On error_append_string => no value => no value error_log => no value => no value error_prepend_string => no value => no value error_reporting => 2039 => 2039 expose_php => On => On extension_dir => ./ => ./ file_uploads => On => On gpc_order => GPC => GPC highlight.bg => #FFFFFF => #FFFFFF highlight.comment => #FF8000 => #FF8000 highlight.default => #0000BB => #0000BB highlight.html => #000000 => #000000 highlight.keyword => #007700 => #007700 highlight.string => #DD0000 => #DD0000 html_errors => Off => On ignore_repeated_errors => Off => Off ignore_repeated_source => Off => Off ignore_user_abort => Off => Off implicit_flush => On => Off include_path => .:/usr/local/lib/php => .:/usr/local/lib/php log_errors => Off => Off log_errors_max_len => 1024 => 1024 magic_quotes_gpc => On => On magic_quotes_runtime => Off => Off magic_quotes_sybase => Off => Off max_execution_time => 0 => 60 max_input_time => -1 => -1 open_basedir => no value => no value output_buffering => no value => no value output_handler => no value => no value post_max_size => 8M => 8M precision => 14 => 14 register_argc_argv => On => On register_globals => On => On report_memleaks => On => On safe_mode => On => On safe_mode_exec_dir => no value => no value safe_mode_gid => Off => Off safe_mode_include_dir => no value => no value sendmail_from => me@localhost.com => me@localhost.com sendmail_path => /usr/bin/sendmail -t -i => /usr/bin/sendmail -t -i short_open_tag => On => On SMTP => localhost => localhost smtp_port => 25 => 25 sql.safe_mode => Off => Off track_errors => Off => Off unserialize_callback_func => no value => no value upload_max_filesize => 2M => 2M upload_tmp_dir => no value => no value user_dir => .html => .html variables_order => EGPCS => EGPCS xmlrpc_error_number => 0 => 0 xmlrpc_errors => Off => Off y2k_compliance => Off => Off bcmath BCMath support => enabled calendar Calendar support => enabled ctype ctype functions => enabled curl CURL support => enabled CURL Information => libcurl/7.10.2 OpenSSL/0.9.6g zlib/1.1.3 dba DBA support => enabled Supported handlers => gdbm ndbm ftp FTP support => enabled gd GD Support => enabled GD Version => bundled (2.0 compatible) FreeType Support => enabled FreeType Linkage => with freetype GIF Read Support => enabled JPG Support => enabled PNG Support => enabled WBMP Support => enabled mysql MySQL Support => enabled Active Persistent Links => 0 Active Links => 0 Client API version => 3.23.54 MYSQL_MODULE_TYPE => external MYSQL_SOCKET => /tmp/mysql.sock MYSQL_INCLUDE => -I/usr/local/mysql/include/mysql MYSQL_LIBS => -L/usr/local/mysql/lib/mysql -lmysqlclient Directive => Local Value => Master Value mysql.allow_persistent => On => On mysql.connect_timeout => -1 => -1 mysql.default_host => localhost => localhost mysql.default_password => no value => no value mysql.default_port => no value => no value mysql.default_socket => no value => no value mysql.default_user => nobody => nobody mysql.max_links => Unlimited => Unlimited mysql.max_persistent => Unlimited => Unlimited mysql.trace_mode => Off => Off openssl OpenSSL support => enabled OpenSSL Version => OpenSSL 0.9.6e 30 Jul 2002 overload User-Space Object Overloading Support => enabled pcre PCRE (Perl Compatible Regular Expressions) Support => enabled PCRE Library Version => 3.92 11-Sep-2002 posix Revision => $Revision: 1.51 $ session Session Support => enabled Registered save handlers => files user Directive => Local Value => Master Value session.auto_start => Off => Off session.bug_compat_42 => On => On session.bug_compat_warn => On => On session.cache_expire => 180 => 180 session.cache_limiter => nocache => nocache session.cookie_domain => no value => no value session.cookie_lifetime => 0 => 0 session.cookie_path => / => / session.cookie_secure => Off => Off session.entropy_file => no value => no value session.entropy_length => 0 => 0 session.gc_dividend => 100 => 100 session.gc_maxlifetime => 1440 => 1440 session.gc_probability => 1 => 1 session.name => PHPSESSID => PHPSESSID session.referer_check => no value => no value session.save_handler => files => files session.save_path => /tmp/php => /tmp/php session.serialize_handler => php => php session.use_cookies => On => On session.use_only_cookies => Off => Off session.use_trans_sid => On => On standard Regex Library => Bundled library enabled Dynamic Library Support => enabled Path to sendmail => /usr/bin/sendmail -t -i Directive => Local Value => Master Value assert.active => 1 => 1 assert.bail => 0 => 0 assert.callback => no value => no value assert.quiet_eval => 0 => 0 assert.warning => 1 => 1 auto_detect_line_endings => 0 => 0 default_socket_timeout => 60 => 60 safe_mode_allowed_env_vars => PHP_ => PHP_ safe_mode_protected_env_vars => LD_LIBRARY_PATH => LD_LIBRARY_PATH url_rewriter.tags => a=href,area=href,frame=src,form=,fieldset= => a=href,area=href,frame=src,form=,fieldset= user_agent => no value => no value tokenizer Tokenizer Support => enabled xml XML Support => active XML Namespace Support => active EXPAT Version => 1.95.2 zlib ZLib Support => enabled Compiled Version => 1.1.4 Linked Version => 1.1.3 Directive => Local Value => Master Value zlib.output_compression => Off => Off zlib.output_compression_level => -1 => -1 zlib.output_handler => no value => no value Additional Modules Module Name Environment Variable => Value PWD => /usr/local/src/www/php-4.3.0 MAKEFLAGS => PAGER => less MFLAGS => HOSTNAME => oodako.interkan.net MOZILLA_HOME => /usr/lib/netscape REDIRECT_STATUS => TEST_PHP_EXECUTABLE => /usr/local/src/www/php-4.3.0/sapi/cli/php LS_OPTIONS => --color=auto -F -b -T 0 ignoreeof => OPENWINHOME => /usr/openwin MANPATH => /usr/man:/usr/contrib/man:/usr/share/man:/usr/X11/man:/usr/local/man LESSOPEN => |lesspipe.sh %s CC => gcc BLOCKSIZE => 1k LESS => -M LS_COLORS => no=00:fi=00:di=01;34:ln=01;36:pi=40;33:so=01;35:bd=40;33;01:cd=40;33;01:or=40;31;01:ex=01;32:*.cmd=01;32:*.exe=01;32:*.com=01;32:*.btm=01;32:*.bat=01;32:*.tar=01;31:*.tgz=01;31:*.arj=01;31:*.taz=01;31:*.lzh=01;31:*.zip=01;31:*.bz2=01;31:*.rpm=01;31:*.deb=01;31:*.z=01;31:*.Z=01;31:*.gz=01;31:*.jpg=01;35:*.gif=01;35:*.bmp=01;35:*.ppm=01;35:*.tga=01;35:*.xbm=01;35:*.xpm=01;35:*.tif=01;35:*.mpg=01;37:*.avi=01;37:*.mov=01;37: USER => jmg SCRIPT_FILENAME => MAIL => /var/mail/jmg PATH_TRANSLATED => EDITOR => pico QUERY_STRING => CONTENT_LENGTH => MAKELEVEL => 1 SSH_CLIENT => 12.13.79.3 2563 22 SHLVL => 3 LOGNAME => jmg MINICOM => -c on SSH_CONNECTION => 12.13.79.3 2563 12.13.79.10 22 _ => /usr/local/src/www/php-4.3.0/sapi/cli/php WWW_HOME => http://www.interkan.net/ REQUEST_METHOD => SHELL => /bin/sh TEST_PHP_SRCDIR => /usr/local/src/www/php-4.3.0 TERM => vt100 HOME => /admin/jmg PATH => /usr/local/bin:/sbin:/usr/local/sbin:/usr/local/vadmin:/bin:/usr/bin:/usr/X11/bin:/usr/contrib/bin:/usr/games:/usr/sbin:/admin/jmg/bin:/.html:. SSH_TTY => /dev/pts/1 EXINIT => set autoindent CONTENT_TYPE => PHP Variables Variable => Value PHP_SELF => _SERVER["PWD"] => /usr/local/src/www/php-4.3.0 _SERVER["MAKEFLAGS"] => _SERVER["PAGER"] => less _SERVER["MFLAGS"] => _SERVER["HOSTNAME"] => oodako.interkan.net _SERVER["MOZILLA_HOME"] => /usr/lib/netscape _SERVER["REDIRECT_STATUS"] => _SERVER["TEST_PHP_EXECUTABLE"] => /usr/local/src/www/php-4.3.0/sapi/cli/php _SERVER["LS_OPTIONS"] => --color=auto -F -b -T 0 _SERVER["ignoreeof"] => _SERVER["OPENWINHOME"] => /usr/openwin _SERVER["MANPATH"] => /usr/man:/usr/contrib/man:/usr/share/man:/usr/X11/man:/usr/local/man _SERVER["LESSOPEN"] => |lesspipe.sh %s _SERVER["CC"] => gcc _SERVER["BLOCKSIZE"] => 1k _SERVER["LESS"] => -M _SERVER["LS_COLORS"] => no=00:fi=00:di=01;34:ln=01;36:pi=40;33:so=01;35:bd=40;33;01:cd=40;33;01:or=40;31;01:ex=01;32:*.cmd=01;32:*.exe=01;32:*.com=01;32:*.btm=01;32:*.bat=01;32:*.tar=01;31:*.tgz=01;31:*.arj=01;31:*.taz=01;31:*.lzh=01;31:*.zip=01;31:*.bz2=01;31:*.rpm=01;31:*.deb=01;31:*.z=01;31:*.Z=01;31:*.gz=01;31:*.jpg=01;35:*.gif=01;35:*.bmp=01;35:*.ppm=01;35:*.tga=01;35:*.xbm=01;35:*.xpm=01;35:*.tif=01;35:*.mpg=01;37:*.avi=01;37:*.mov=01;37: _SERVER["USER"] => jmg _SERVER["SCRIPT_FILENAME"] => _SERVER["MAIL"] => /var/mail/jmg _SERVER["PATH_TRANSLATED"] => _SERVER["EDITOR"] => pico _SERVER["QUERY_STRING"] => _SERVER["CONTENT_LENGTH"] => _SERVER["MAKELEVEL"] => 1 _SERVER["SSH_CLIENT"] => 12.13.79.3 2563 22 _SERVER["SHLVL"] => 3 _SERVER["LOGNAME"] => jmg _SERVER["MINICOM"] => -c on _SERVER["SSH_CONNECTION"] => 12.13.79.3 2563 12.13.79.10 22 _SERVER["_"] => /usr/local/src/www/php-4.3.0/sapi/cli/php _SERVER["WWW_HOME"] => http://www.interkan.net/ _SERVER["REQUEST_METHOD"] => _SERVER["SHELL"] => /bin/sh _SERVER["TEST_PHP_SRCDIR"] => /usr/local/src/www/php-4.3.0 _SERVER["TERM"] => vt100 _SERVER["HOME"] => /admin/jmg _SERVER["PATH"] => /usr/local/bin:/sbin:/usr/local/sbin:/usr/local/vadmin:/bin:/usr/bin:/usr/X11/bin:/usr/contrib/bin:/usr/games:/usr/sbin:/admin/jmg/bin:/.html:. _SERVER["SSH_TTY"] => /dev/pts/1 _SERVER["EXINIT"] => set autoindent _SERVER["CONTENT_TYPE"] => _SERVER["PHP_SELF"] => _SERVER["SCRIPT_NAME"] => _SERVER["DOCUMENT_ROOT"] => _SERVER["argv"] => Array ( ) _SERVER["argc"] => 0 _ENV["PWD"] => /usr/local/src/www/php-4.3.0 _ENV["MAKEFLAGS"] => _ENV["PAGER"] => less _ENV["MFLAGS"] => _ENV["HOSTNAME"] => oodako.interkan.net _ENV["MOZILLA_HOME"] => /usr/lib/netscape _ENV["REDIRECT_STATUS"] => _ENV["TEST_PHP_EXECUTABLE"] => /usr/local/src/www/php-4.3.0/sapi/cli/php _ENV["LS_OPTIONS"] => --color=auto -F -b -T 0 _ENV["ignoreeof"] => _ENV["OPENWINHOME"] => /usr/openwin _ENV["MANPATH"] => /usr/man:/usr/contrib/man:/usr/share/man:/usr/X11/man:/usr/local/man _ENV["LESSOPEN"] => |lesspipe.sh %s _ENV["CC"] => gcc _ENV["BLOCKSIZE"] => 1k _ENV["LESS"] => -M _ENV["LS_COLORS"] => no=00:fi=00:di=01;34:ln=01;36:pi=40;33:so=01;35:bd=40;33;01:cd=40;33;01:or=40;31;01:ex=01;32:*.cmd=01;32:*.exe=01;32:*.com=01;32:*.btm=01;32:*.bat=01;32:*.tar=01;31:*.tgz=01;31:*.arj=01;31:*.taz=01;31:*.lzh=01;31:*.zip=01;31:*.bz2=01;31:*.rpm=01;31:*.deb=01;31:*.z=01;31:*.Z=01;31:*.gz=01;31:*.jpg=01;35:*.gif=01;35:*.bmp=01;35:*.ppm=01;35:*.tga=01;35:*.xbm=01;35:*.xpm=01;35:*.tif=01;35:*.mpg=01;37:*.avi=01;37:*.mov=01;37: _ENV["USER"] => jmg _ENV["SCRIPT_FILENAME"] => _ENV["MAIL"] => /var/mail/jmg _ENV["PATH_TRANSLATED"] => _ENV["EDITOR"] => pico _ENV["QUERY_STRING"] => _ENV["CONTENT_LENGTH"] => _ENV["MAKELEVEL"] => 1 _ENV["SSH_CLIENT"] => 12.13.79.3 2563 22 _ENV["SHLVL"] => 3 _ENV["LOGNAME"] => jmg _ENV["MINICOM"] => -c on _ENV["SSH_CONNECTION"] => 12.13.79.3 2563 12.13.79.10 22 _ENV["_"] => /usr/local/src/www/php-4.3.0/sapi/cli/php _ENV["WWW_HOME"] => http://www.interkan.net/ _ENV["REQUEST_METHOD"] => _ENV["SHELL"] => /bin/sh _ENV["TEST_PHP_SRCDIR"] => /usr/local/src/www/php-4.3.0 _ENV["TERM"] => vt100 _ENV["HOME"] => /admin/jmg _ENV["PATH"] => /usr/local/bin:/sbin:/usr/local/sbin:/usr/local/vadmin:/bin:/usr/bin:/usr/X11/bin:/usr/contrib/bin:/usr/games:/usr/sbin:/admin/jmg/bin:/.html:. _ENV["SSH_TTY"] => /dev/pts/1 _ENV["EXINIT"] => set autoindent _ENV["CONTENT_TYPE"] => PHP License This program is free software; you can redistribute it and/or modify it under the terms of the PHP License as published by the PHP Group and included in the distribution in the file: LICENSE This program is distributed in the hope that it will be useful, but WITHOUT ANY WARRANTY; without even the implied warranty of MERCHANTABILITY or FITNESS FOR A PARTICULAR PURPOSE. If you did not receive a copy of the PHP license, or have any questions about PHP licensing, please contact license@php.net.

« previous php.qa (#7966) next »