Test results [failed]

From: Date: Sat, 11 Jan 2003 18:27:19 +0000
Subject: Test results [failed]
Groups: php.qa 
Request: Send a blank email to php-qa+get-7967@lists.php.net to get a copy of this message
===================================================================== FAILED TEST SUMMARY --------------------------------------------------------------------- PostgreSQL escape functions [ext/pgsql/tests/08escape.phpt] PostgreSQL pg_convert() [ext/pgsql/tests/10pg_convert.phpt] PostgreSQL pg_insert() [ext/pgsql/tests/12pg_insert.phpt] PostgreSQL pg_select() [ext/pgsql/tests/13pg_select.phpt] PostgreSQL pg_update() [ext/pgsql/tests/14pg_update.phpt] PostgreSQL pg_escape_bytea() functions [ext/pgsql/tests/18pg_escape_bytea.phpt] session object serialization [ext/session/tests/001.phpt] session object deserialization [ext/session/tests/003.phpt] correct instantiation of references between variables in sessions [ext/session/tests/006.phpt] bug compatibility: unset($c) with enabled register_globals [ext/session/tests/007.phpt] bug compatibility: global is used albeit register_globals=0 [ext/session/tests/008-php4.2.3.phpt] unset($_SESSION["name"]); should work with register_globals=off [ext/session/tests/009.phpt] registering $_SESSION should not segfault [ext/session/tests/012.phpt] redefining SID should not cause warnings [ext/session/tests/013.phpt] a script should not be able to modify session.use_trans_sid [ext/session/tests/014.phpt] use_trans_sid should not affect SID [ext/session/tests/015.phpt] setting $_SESSION before session_start() should not cause segfault [ext/session/tests/017.phpt] rewriter correctly handles attribute names which contain dashes [ext/session/tests/018.phpt] serializing references test case using globals [ext/session/tests/019.phpt] rewriter uses arg_seperator.output for modifying URLs [ext/session/tests/020.phpt] rewriter handles form and fieldset tags correctly [ext/session/tests/021.phpt] ===================================================================== ===================================================================== TEST RESULT SUMMARY --------------------------------------------------------------------- Exts skipped : 77 Exts tested : 11 --------------------------------------------------------------------- Number of tests : 443 Tests skipped : 200 (45.1%) Tests failed : 21 ( 4.7%) Tests passed : 222 (50.1%) --------------------------------------------------------------------- Time taken : 38 seconds ===================================================================== ================================================================================ /home/zkrr01/php-4.3.0/ext/pgsql/tests/08escape.phpt ================================================================================ ---- EXPECTED OUTPUT pg_escape_string() is NOT Ok string(9) "ABC\ABC\'" string(12) "ABC\\ABC\\''" string(10) "ABC\\ABC\'" pg_escape_bytea() is Ok ---- ACTUAL OUTPUT Fatal error: Call to undefined function: pg_escape_string() in /home/zkrr01/php-4.3.0/ext/pgsql/tests/escape.inc on line 9 ---- FAILED ================================================================================ 001- pg_escape_string() is NOT Ok 001+ Fatal error: Call to undefined function: pg_escape_string() in /home/zkrr01/php-4.3.0/ext/pgsql/tests/escape.inc on line 9 002- string(9) "ABC\ABC\'" 003- string(12) "ABC\\ABC\\''" 004- string(10) "ABC\\ABC\'" 005- pg_escape_bytea() is Ok ================================================================================ ================================================================================ /home/zkrr01/php-4.3.0/ext/pgsql/tests/10pg_convert.phpt ================================================================================ ---- EXPECTED OUTPUT array(3) { ["num"]=> string(4) "1234" ["str"]=> string(5) "'AAA'" ["bin"]=> string(5) "'BBB'" } ---- ACTUAL OUTPUT Notice: pg_convert() [/phpmanual/function.pg-convert.html]: Unknown or system data type 'bytea' for 'bin'. in /home/zkrr01/php-4.3.0/ext/pgsql/tests/pg_convert.inc on line 9 bool(false) ---- FAILED ================================================================================ 001- array(3) { 001+ Notice: pg_convert() [/phpmanual/function.pg-convert.html]: Unknown or system data type 'bytea' for 'bin'. in /home/zkrr01/php-4.3.0/ext/pgsql/tests/pg_convert.inc on line 9 002- ["num"]=> 002+ bool(false) 003- string(4) "1234" 004- ["str"]=> 005- string(5) "'AAA'" 006- ["bin"]=> 007- string(5) "'BBB'" 008- } ================================================================================ ================================================================================ /home/zkrr01/php-4.3.0/ext/pgsql/tests/12pg_insert.phpt ================================================================================ ---- EXPECTED OUTPUT INSERT INTO php_pgsql_test (num,str,bin) VALUES (1234,'AAA','BBB'); Ok ---- ACTUAL OUTPUT Notice: pg_insert() [/phpmanual/function.pg-insert.html]: Unknown or system data type 'bytea' for 'bin'. in /home/zkrr01/php-4.3.0/ext/pgsql/tests/pg_insert.inc on line 9 Error in test 1 Notice: pg_insert() [/phpmanual/function.pg-insert.html]: Unknown or system data type 'bytea' for 'bin'. in /home/zkrr01/php-4.3.0/ext/pgsql/tests/pg_insert.inc on line 10 Ok ---- FAILED ================================================================================ 001- INSERT INTO php_pgsql_test (num,str,bin) VALUES (1234,'AAA','BBB'); 001+ Notice: pg_insert() [/phpmanual/function.pg-insert.html]: Unknown or system data type 'bytea' for 'bin'. in /home/zkrr01/php-4.3.0/ext/pgsql/tests/pg_insert.inc on line 9 002- Ok 002+ Error in test 1 003+ 004+ Notice: pg_insert() [/phpmanual/function.pg-insert.html]: Unknown or system data type 'bytea' for 'bin'. in /home/zkrr01/php-4.3.0/ext/pgsql/tests/pg_insert.inc on line 10 005+ 006+ Ok ================================================================================ ================================================================================ /home/zkrr01/php-4.3.0/ext/pgsql/tests/13pg_select.phpt ================================================================================ ---- EXPECTED OUTPUT array(1) { [0]=> array(3) { ["num"]=> string(4) "1234" ["str"]=> string(3) "AAA" ["bin"]=> string(3) "BBB" } } SELECT * FROM php_pgsql_test WHERE num=1234; Ok ---- ACTUAL OUTPUT Error bool(false) Ok ---- FAILED ================================================================================ 001- array(1) { 001+ Error 002- [0]=> 002+ bool(false) 003- array(3) { 003+ 004- ["num"]=> 004+ Ok 005- string(4) "1234" 006- ["str"]=> 007- string(3) "AAA" 008- ["bin"]=> 009- string(3) "BBB" 010- } 011- } 012- SELECT * FROM php_pgsql_test WHERE num=1234; 013- Ok ================================================================================ ================================================================================ /home/zkrr01/php-4.3.0/ext/pgsql/tests/14pg_update.phpt ================================================================================ ---- EXPECTED OUTPUT UPDATE php_pgsql_test SET num=1234,str='ABC',bin='XYZ' WHERE num=1234; Ok ---- ACTUAL OUTPUT Notice: pg_update() [/phpmanual/function.pg-update.html]: Unknown or system data type 'bytea' for 'bin'. in /home/zkrr01/php-4.3.0/ext/pgsql/tests/pg_update.inc on line 10 Error in test 1 Notice: pg_update() [/phpmanual/function.pg-update.html]: Unknown or system data type 'bytea' for 'bin'. in /home/zkrr01/php-4.3.0/ext/pgsql/tests/pg_update.inc on line 11 Ok ---- FAILED ================================================================================ 001- UPDATE php_pgsql_test SET num=1234,str='ABC',bin='XYZ' WHERE num=1234; 001+ Notice: pg_update() [/phpmanual/function.pg-update.html]: Unknown or system data type 'bytea' for 'bin'. in /home/zkrr01/php-4.3.0/ext/pgsql/tests/pg_update.inc on line 10 002- Ok 002+ Error in test 1 003+ 004+ Notice: pg_update() [/phpmanual/function.pg-update.html]: Unknown or system data type 'bytea' for 'bin'. in /home/zkrr01/php-4.3.0/ext/pgsql/tests/pg_update.inc on line 11 005+ 006+ Ok ================================================================================ ================================================================================ /home/zkrr01/php-4.3.0/ext/pgsql/tests/18pg_escape_bytea.phpt ================================================================================ ---- EXPECTED OUTPUT OK ---- ACTUAL OUTPUT Fatal error: Call to undefined function: pg_escape_bytea() in /home/zkrr01/php-4.3.0/ext/pgsql/tests/pg_escape_bytea.inc on line 9 ---- FAILED ================================================================================ 001- OK 001+ Fatal error: Call to undefined function: pg_escape_bytea() in /home/zkrr01/php-4.3.0/ext/pgsql/tests/pg_escape_bytea.inc on line 9 ================================================================================ ================================================================================ /home/zkrr01/php-4.3.0/ext/session/tests/001.phpt ================================================================================ ---- EXPECTED OUTPUT baz|O:3:"foo":2:{s:3:"bar";s:2:"ok";s:3:"yes";s:4:"done";}arr|a:1:{i:3;O:3:"foo":2:{s:3:"bar";s:2:"ok";s:3:"yes";s:4:"done";}} ---- ACTUAL OUTPUT Warning: session_register() [/phpmanual/function.session-register.html]: read failed: Value too large for defined data type (75) in /home/zkrr01/php-4.3.0/ext/session/tests/001.php on line 16 baz|O:3:"foo":2:{s:3:"bar";s:2:"ok";s:3:"yes";s:4:"done";}arr|a:1:{i:3;O:3:"foo":2:{s:3:"bar";s:2:"ok";s:3:"yes";s:4:"done";}} ---- FAILED ================================================================================ 001- baz|O:3:"foo":2:{s:3:"bar";s:2:"ok";s:3:"yes";s:4:"done";}arr|a:1:{i:3;O:3:"foo":2:{s:3:"bar";s:2:"ok";s:3:"yes";s:4:"done";}} 001+ Warning: session_register() [/phpmanual/function.session-register.html]: read failed: Value too large for defined data type (75) in /home/zkrr01/php-4.3.0/ext/session/tests/001.php on line 16 002+ baz|O:3:"foo":2:{s:3:"bar";s:2:"ok";s:3:"yes";s:4:"done";}arr|a:1:{i:3;O:3:"foo":2:{s:3:"bar";s:2:"ok";s:3:"yes";s:4:"done";}} ================================================================================ ================================================================================ /home/zkrr01/php-4.3.0/ext/session/tests/003.phpt ================================================================================ ---- EXPECTED OUTPUT object(foo)(2) { ["bar"]=> string(2) "ok" ["yes"]=> int(2) } array(1) { [3]=> &object(foo)(2) { ["bar"]=> string(2) "ok" ["yes"]=> int(2) } } ---- ACTUAL OUTPUT Warning: session_start() [/phpmanual/function.session-start.html]: read failed: Value too large for defined data type (75) in /home/zkrr01/php-4.3.0/ext/session/tests/003.php on line 10 object(foo)(2) { ["bar"]=> string(2) "ok" ["yes"]=> int(2) } array(1) { [3]=> &object(foo)(2) { ["bar"]=> string(2) "ok" ["yes"]=> int(2) } } ---- FAILED ================================================================================ 001- object(foo)(2) { 001+ Warning: session_start() [/phpmanual/function.session-start.html]: read failed: Value too large for defined data type (75) in /home/zkrr01/php-4.3.0/ext/session/tests/003.php on line 10 002- ["bar"]=> 002+ object(foo)(2) { 003- string(2) "ok" 003+ ["bar"]=> 004- ["yes"]=> 004+ string(2) "ok" 005- int(2) 005+ ["yes"]=> 006- } 006+ int(2) 007- array(1) { 007+ } 008- [3]=> 008+ array(1) { 009- &object(foo)(2) { 009+ [3]=> 010- ["bar"]=> 010+ &object(foo)(2) { 011- string(2) "ok" 011+ ["bar"]=> 012- ["yes"]=> 012+ string(2) "ok" 013- int(2) 013+ ["yes"]=> 014- } 014+ int(2) 015- } 015+ } 016+ } ================================================================================ ================================================================================ /home/zkrr01/php-4.3.0/ext/session/tests/006.phpt ================================================================================ ---- EXPECTED OUTPUT original values: object(a)(1) { ["test"]=> string(5) "hallo" } object(b)(1) { ["a"]=> &object(a)(1) { ["test"]=> string(5) "hallo" } } values after session: object(a)(1) { ["test"]=> string(5) "hallo" } object(b)(1) { ["a"]=> &object(a)(1) { ["test"]=> string(5) "hallo" } } ---- ACTUAL OUTPUT Warning: session_start() [/phpmanual/function.session-start.html]: read failed: Value too large for defined data type (75) in /home/zkrr01/php-4.3.0/ext/session/tests/006.php on line 5 original values: object(a)(1) { ["test"]=> string(5) "hallo" } object(b)(1) { ["a"]=> &object(a)(1) { ["test"]=> string(5) "hallo" } } values after session: object(a)(1) { ["test"]=> string(5) "hallo" } object(b)(1) { ["a"]=> &object(a)(1) { ["test"]=> string(5) "hallo" } } ---- FAILED ================================================================================ 001- original values: 001+ Warning: session_start() [/phpmanual/function.session-start.html]: read failed: Value too large for defined data type (75) in /home/zkrr01/php-4.3.0/ext/session/tests/006.php on line 5 002- object(a)(1) { 002+ original values: 003- ["test"]=> 003+ object(a)(1) { 004- string(5) "hallo" 004+ ["test"]=> 005- } 005+ string(5) "hallo" 006- object(b)(1) { 006+ } 007- ["a"]=> 007+ object(b)(1) { 008- &object(a)(1) { 008+ ["a"]=> 009- ["test"]=> 009+ &object(a)(1) { 010- string(5) "hallo" 010+ ["test"]=> 011- } 011+ string(5) "hallo" 012- } 012+ } 013- values after session: 013+ } 014- object(a)(1) { 014+ values after session: 015- ["test"]=> 015+ object(a)(1) { 016- string(5) "hallo" 016+ ["test"]=> 017- } 017+ string(5) "hallo" 018- object(b)(1) { 018+ } 019- ["a"]=> 019+ object(b)(1) { 020- &object(a)(1) { 020+ ["a"]=> 021- ["test"]=> 021+ &object(a)(1) { 022- string(5) "hallo" 022+ ["test"]=> 023- } 023+ string(5) "hallo" 024- } 024+ } 025+ } ================================================================================ ================================================================================ /home/zkrr01/php-4.3.0/ext/session/tests/007.phpt ================================================================================ ---- EXPECTED OUTPUT float(3.14) array(1) { ["c"]=> &float(3.14) } float(3.14) array(1) { ["c"]=> &float(3.14) } ---- ACTUAL OUTPUT Warning: session_register() [/phpmanual/function.session-register.html]: read failed: Value too large for defined data type (75) in /home/zkrr01/php-4.3.0/ext/session/tests/007.php on line 12 float(3.14) array(1) { ["c"]=> &float(3.14) } float(3.14) array(1) { ["c"]=> &float(3.14) } ---- FAILED ================================================================================ 001- float(3.14) 001+ Warning: session_register() [/phpmanual/function.session-register.html]: read failed: Value too large for defined data type (75) in /home/zkrr01/php-4.3.0/ext/session/tests/007.php on line 12 002- array(1) { 002+ float(3.14) 003- ["c"]=> 003+ array(1) { 004- &float(3.14) 004+ ["c"]=> 005- } 005+ &float(3.14) 006- float(3.14) 006+ } 007- array(1) { 007+ float(3.14) 008- ["c"]=> 008+ array(1) { 009- &float(3.14) 009+ ["c"]=> 010- } 010+ &float(3.14) 011+ } ================================================================================ ================================================================================ /home/zkrr01/php-4.3.0/ext/session/tests/008-php4.2.3.phpt ================================================================================ ---- EXPECTED OUTPUT NULL Your script possibly relies on a session side-effect which existed until PHP 4.2.3. Please be advised that the session extension does not consider global variables as a source of data, unless register_globals is enabled. You can disable this functionality and this warning by setting session.bug_compat_42 or session.bug_compat_warn to off, respectively. array(1) { ["c"]=> float(3.14) } NULL array(1) { ["c"]=> float(3.14) } ---- ACTUAL OUTPUT Warning: session_start() [/phpmanual/function.session-start.html]: read failed: Value too large for defined data type (75) in /home/zkrr01/php-4.3.0/ext/session/tests/008-php4.2.3.php on line 5 Warning: session_register() [/phpmanual/function.session-register.html]: read failed: Value too large for defined data type (75) in /home/zkrr01/php-4.3.0/ext/session/tests/008-php4.2.3.php on line 10 NULL Your script possibly relies on a session side-effect which existed until PHP 4.2.3. Please be advised that the session extension does not consider global variables as a source of data, unless register_globals is enabled. You can disable this functionality and this warning by setting session.bug_compat_42 or session.bug_compat_warn to off, respectively. array(1) { ["c"]=> float(3.14) } NULL array(1) { ["c"]=> float(3.14) } ---- FAILED ================================================================================ 001- NULL 001+ Warning: session_start() [/phpmanual/function.session-start.html]: read failed: Value too large for defined data type (75) in /home/zkrr01/php-4.3.0/ext/session/tests/008-php4.2.3.php on line 5 002- Your script possibly relies on a session side-effect which existed until PHP 4.2.3. Please be advised that the session extension does not consider global variables as a source of data, unless register_globals is enabled. You can disable this functionality and this warning by setting session.bug_compat_42 or session.bug_compat_warn to off, respectively. 002+ 003- array(1) { 003+ Warning: session_register() [/phpmanual/function.session-register.html]: read failed: Value too large for defined data type (75) in /home/zkrr01/php-4.3.0/ext/session/tests/008-php4.2.3.php on line 10 004- ["c"]=> 004+ NULL 005- float(3.14) 005+ Your script possibly relies on a session side-effect which existed until PHP 4.2.3. Please be advised that the session extension does not consider global variables as a source of data, unless register_globals is enabled. You can disable this functionality and this warning by setting session.bug_compat_42 or session.bug_compat_warn to off, respectively. 006- } 006+ array(1) { 007- NULL 007+ ["c"]=> 008- array(1) { 008+ float(3.14) 009- ["c"]=> 009+ } 010- float(3.14) 010+ NULL 011- } 011+ array(1) { 012+ ["c"]=> 013+ float(3.14) 014+ } ================================================================================ ================================================================================ /home/zkrr01/php-4.3.0/ext/session/tests/009.phpt ================================================================================ ---- EXPECTED OUTPUT array(0) { } array(1) { ["name"]=> string(3) "foo" } array(1) { ["name"]=> string(3) "foo" } array(0) { } array(0) { } ---- ACTUAL OUTPUT Warning: session_start() [/phpmanual/function.session-start.html]: read failed: Value too large for defined data type (75) in /home/zkrr01/php-4.3.0/ext/session/tests/009.php on line 7 Warning: session_start() [/phpmanual/function.session-start.html]: read failed: Value too large for defined data type (75) in /home/zkrr01/php-4.3.0/ext/session/tests/009.php on line 12 array(0) { } array(1) { ["name"]=> string(3) "foo" } array(1) { ["name"]=> string(3) "foo" } array(0) { } Warning: session_start() [/phpmanual/function.session-start.html]: read failed: Value too large for defined data type (75) in /home/zkrr01/php-4.3.0/ext/session/tests/009.php on line 27 array(0) { } ---- FAILED ================================================================================ 001- array(0) { 001+ Warning: session_start() [/phpmanual/function.session-start.html]: read failed: Value too large for defined data type (75) in /home/zkrr01/php-4.3.0/ext/session/tests/009.php on line 7 002- } 002+ 003- array(1) { 003+ Warning: session_start() [/phpmanual/function.session-start.html]: read failed: Value too large for defined data type (75) in /home/zkrr01/php-4.3.0/ext/session/tests/009.php on line 12 004- ["name"]=> 004+ array(0) { 005- string(3) "foo" 005+ } 006- } 006+ array(1) { 007- array(1) { 007+ ["name"]=> 008- ["name"]=> 008+ string(3) "foo" 009- string(3) "foo" 009+ } 010- } 010+ array(1) { 011- array(0) { 011+ ["name"]=> 012- } 012+ string(3) "foo" 013- array(0) { 013+ } 014- } 014+ array(0) { 015+ } 016+ 017+ Warning: session_start() [/phpmanual/function.session-start.html]: read failed: Value too large for defined data type (75) in /home/zkrr01/php-4.3.0/ext/session/tests/009.php on line 27 018+ array(0) { 019+ } ================================================================================ ================================================================================ /home/zkrr01/php-4.3.0/ext/session/tests/012.phpt ================================================================================ ---- EXPECTED OUTPUT I live ---- ACTUAL OUTPUT Warning: session_start() [/phpmanual/function.session-start.html]: read failed: Value too large for defined data type (75) in /home/zkrr01/php-4.3.0/ext/session/tests/012.php on line 7 Warning: session_start() [/phpmanual/function.session-start.html]: read failed: Value too large for defined data type (75) in /home/zkrr01/php-4.3.0/ext/session/tests/012.php on line 15 I live ---- FAILED ================================================================================ 001- I live 001+ Warning: session_start() [/phpmanual/function.session-start.html]: read failed: Value too large for defined data type (75) in /home/zkrr01/php-4.3.0/ext/session/tests/012.php on line 7 002+ 003+ Warning: session_start() [/phpmanual/function.session-start.html]: read failed: Value too large for defined data type (75) in /home/zkrr01/php-4.3.0/ext/session/tests/012.php on line 15 004+ I live ================================================================================ ================================================================================ /home/zkrr01/php-4.3.0/ext/session/tests/013.phpt ================================================================================ ---- EXPECTED OUTPUT I live ---- ACTUAL OUTPUT Warning: session_start() [/phpmanual/function.session-start.html]: read failed: Value too large for defined data type (75) in /home/zkrr01/php-4.3.0/ext/session/tests/013.php on line 5 Warning: session_start() [/phpmanual/function.session-start.html]: read failed: Value too large for defined data type (75) in /home/zkrr01/php-4.3.0/ext/session/tests/013.php on line 8 I live ---- FAILED ================================================================================ 001- I live 001+ Warning: session_start() [/phpmanual/function.session-start.html]: read failed: Value too large for defined data type (75) in /home/zkrr01/php-4.3.0/ext/session/tests/013.php on line 5 002+ 003+ Warning: session_start() [/phpmanual/function.session-start.html]: read failed: Value too large for defined data type (75) in /home/zkrr01/php-4.3.0/ext/session/tests/013.php on line 8 004+ I live ================================================================================ ================================================================================ /home/zkrr01/php-4.3.0/ext/session/tests/014.phpt ================================================================================ ---- EXPECTED OUTPUT <a href="/link?PHPSESSID=abtest"> <a href="/link?PHPSESSID=abtest"> <a href="/link?PHPSESSID=abtest"> ---- ACTUAL OUTPUT Warning: session_start() [/phpmanual/function.session-start.html]: read failed: Value too large for defined data type (75) in /home/zkrr01/php-4.3.0/ext/session/tests/014.php on line 5 <a href="/link?PHPSESSID=abtest"> <a href="/link?PHPSESSID=abtest"> <a href="/link?PHPSESSID=abtest"> ---- FAILED ================================================================================ 001- <a href="/link?PHPSESSID=abtest"> 001+ Warning: session_start() [/phpmanual/function.session-start.html]: read failed: Value too large for defined data type (75) in /home/zkrr01/php-4.3.0/ext/session/tests/014.php on line 5 004+ <a href="/link?PHPSESSID=abtest"> ================================================================================ ================================================================================ /home/zkrr01/php-4.3.0/ext/session/tests/015.phpt ================================================================================ ---- EXPECTED OUTPUT <a href="/link?PHPSESSID=abtest&PHPSESSID=abtest"> ---- ACTUAL OUTPUT Warning: session_start() [/phpmanual/function.session-start.html]: read failed: Value too large for defined data type (75) in /home/zkrr01/php-4.3.0/ext/session/tests/015.php on line 5 <a href="/link?PHPSESSID=abtest&PHPSESSID=abtest"> ---- FAILED ================================================================================ 001- <a href="/link?PHPSESSID=abtest&PHPSESSID=abtest"> 001+ Warning: session_start() [/phpmanual/function.session-start.html]: read failed: Value too large for defined data type (75) in /home/zkrr01/php-4.3.0/ext/session/tests/015.php on line 5 002+ <a href="/link?PHPSESSID=abtest&PHPSESSID=abtest"> ================================================================================ ================================================================================ /home/zkrr01/php-4.3.0/ext/session/tests/017.phpt ================================================================================ ---- EXPECTED OUTPUT I live ---- ACTUAL OUTPUT Warning: session_start() [/phpmanual/function.session-start.html]: read failed: Value too large for defined data type (75) in /home/zkrr01/php-4.3.0/ext/session/tests/017.php on line 8 I live ---- FAILED ================================================================================ 001- I live 001+ Warning: session_start() [/phpmanual/function.session-start.html]: read failed: Value too large for defined data type (75) in /home/zkrr01/php-4.3.0/ext/session/tests/017.php on line 8 002+ I live ================================================================================ ================================================================================ /home/zkrr01/php-4.3.0/ext/session/tests/018.phpt ================================================================================ ---- EXPECTED OUTPUT <form accept-charset="ISO-8859-15, ISO-8859-1" action=url.php><input type="hidden" name="PHPSESSID" value="abtest" /> ---- ACTUAL OUTPUT Warning: session_start() [/phpmanual/function.session-start.html]: read failed: Value too large for defined data type (75) in /home/zkrr01/php-4.3.0/ext/session/tests/018.php on line 6 <form accept-charset="ISO-8859-15, ISO-8859-1" action=url.php><input type="hidden" name="PHPSESSID" value="abtest" /> ---- FAILED ================================================================================ 001- <form accept-charset="ISO-8859-15, ISO-8859-1" action=url.php><input type="hidden" name="PHPSESSID" value="abtest" /> 001+ Warning: session_start() [/phpmanual/function.session-start.html]: read failed: Value too large for defined data type (75) in /home/zkrr01/php-4.3.0/ext/session/tests/018.php on line 6 002+ <form accept-charset="ISO-8859-15, ISO-8859-1" action=url.php><input type="hidden" name="PHPSESSID" value="abtest" /> ================================================================================ ================================================================================ /home/zkrr01/php-4.3.0/ext/session/tests/019.phpt ================================================================================ ---- EXPECTED OUTPUT array(2) { ["o1"]=> &object(tfoo)(1) { ["c"]=> int(42) } ["o2"]=> &object(tfoo)(1) { ["c"]=> int(42) } } array(2) { ["o1"]=> &object(tfoo)(1) { ["c"]=> int(44) } ["o2"]=> &object(tfoo)(1) { ["c"]=> int(44) } } ---- ACTUAL OUTPUT Warning: session_register() [/phpmanual/function.session-register.html]: read failed: Value too large for defined data type (75) in /home/zkrr01/php-4.3.0/ext/session/tests/019.php on line 16 array(2) { ["o1"]=> &object(tfoo)(1) { ["c"]=> int(42) } ["o2"]=> &object(tfoo)(1) { ["c"]=> int(42) } } array(2) { ["o1"]=> &object(tfoo)(1) { ["c"]=> int(44) } ["o2"]=> &object(tfoo)(1) { ["c"]=> int(44) } } ---- FAILED ================================================================================ 001- array(2) { 001+ Warning: session_register() [/phpmanual/function.session-register.html]: read failed: Value too large for defined data type (75) in /home/zkrr01/php-4.3.0/ext/session/tests/019.php on line 16 002- ["o1"]=> 002+ array(2) { 003- &object(tfoo)(1) { 003+ ["o1"]=> 004- ["c"]=> 004+ &object(tfoo)(1) { 005- int(42) 005+ ["c"]=> 006- } 006+ int(42) 007- ["o2"]=> 007+ } 008- &object(tfoo)(1) { 008+ ["o2"]=> 009- ["c"]=> 009+ &object(tfoo)(1) { 010- int(42) 010+ ["c"]=> 011- } 011+ int(42) 012- } 012+ } 013- array(2) { 013+ } 014- ["o1"]=> 014+ array(2) { 015- &object(tfoo)(1) { 015+ ["o1"]=> 016- ["c"]=> 016+ &object(tfoo)(1) { 017- int(44) 017+ ["c"]=> 018- } 018+ int(44) 019- ["o2"]=> 019+ } 020- &object(tfoo)(1) { 020+ ["o2"]=> 021- ["c"]=> 021+ &object(tfoo)(1) { 022- int(44) 022+ ["c"]=> 023- } 023+ int(44) 024- } 024+ } 025+ } ================================================================================ ================================================================================ /home/zkrr01/php-4.3.0/ext/session/tests/020.phpt ================================================================================ ---- EXPECTED OUTPUT <a href="link.php?a=b&amp;PHPSESSID=abtest"> ---- ACTUAL OUTPUT Warning: session_start() [/phpmanual/function.session-start.html]: read failed: Value too large for defined data type (75) in /home/zkrr01/php-4.3.0/ext/session/tests/020.php on line 6 <a href="link.php?a=b&amp;PHPSESSID=abtest"> ---- FAILED ================================================================================ 001- <a href="link.php?a=b&amp;PHPSESSID=abtest"> 001+ Warning: session_start() [/phpmanual/function.session-start.html]: read failed: Value too large for defined data type (75) in /home/zkrr01/php-4.3.0/ext/session/tests/020.php on line 6 002+ <a href="link.php?a=b&amp;PHPSESSID=abtest"> ================================================================================ ================================================================================ /home/zkrr01/php-4.3.0/ext/session/tests/021.phpt ================================================================================ ---- EXPECTED OUTPUT <form><input type="hidden" name="PHPSESSID" value="abtest" /> <fieldset><input type="hidden" name="PHPSESSID" value="abtest" /> <form><input type="hidden" name="PHPSESSID" value="abtest" /> <fieldset> <form><input type="hidden" name="PHPSESSID" value="abtest" /> <fieldset> <form> <fieldset><input type="hidden" name="PHPSESSID" value="abtest" /> ---- ACTUAL OUTPUT Warning: session_start() [/phpmanual/function.session-start.html]: read failed: Value too large for defined data type (75) in /home/zkrr01/php-4.3.0/ext/session/tests/021.php on line 6 <form><input type="hidden" name="PHPSESSID" value="abtest" /> <fieldset><input type="hidden" name="PHPSESSID" value="abtest" /> <form><input type="hidden" name="PHPSESSID" value="abtest" /> <fieldset> <form><input type="hidden" name="PHPSESSID" value="abtest" /> <fieldset> <form> <fieldset><input type="hidden" name="PHPSESSID" value="abtest" /> ---- FAILED ================================================================================ 001- <form><input type="hidden" name="PHPSESSID" value="abtest" /> 001+ Warning: session_start() [/phpmanual/function.session-start.html]: read failed: Value too large for defined data type (75) in /home/zkrr01/php-4.3.0/ext/session/tests/021.php on line 6 002- <fieldset><input type="hidden" name="PHPSESSID" value="abtest" /> 002+ <form><input type="hidden" name="PHPSESSID" value="abtest" /> 003- <form><input type="hidden" name="PHPSESSID" value="abtest" /> 003+ <fieldset><input type="hidden" name="PHPSESSID" value="abtest" /> 004- <fieldset> 004+ <form><input type="hidden" name="PHPSESSID" value="abtest" /> 005- <form><input type="hidden" name="PHPSESSID" value="abtest" /> 005+ <fieldset> 006- <fieldset> 006+ <form><input type="hidden" name="PHPSESSID" value="abtest" /> 007- <form> 007+ <fieldset> 008- <fieldset><input type="hidden" name="PHPSESSID" value="abtest" /> 008+ <form> 009+ <fieldset><input type="hidden" name="PHPSESSID" value="abtest" /> ================================================================================ ================================================================================ BUILD ENVIRONMENT ================================================================================ OS: Linux Automake: automake (GNU automake) 1.4 Copyright (C) 1999 Free Software Foundation, Inc. This is free software; see the source for copying conditions. There is NO warranty; not even for MERCHANTABILITY or FITNESS FOR A PARTICULAR PURPOSE. Written by Tom Tromey <tromey@cygnus.com> Autoconf: autoconf (GNU Autoconf) 2.52 Written by David J. MacKenzie. Copyright 1992, 1993, 1994, 1996, 1999, 2000, 2001 Free Software Foundation, Inc. This is free software; see the source for copying conditions. There is NO warranty; not even for MERCHANTABILITY or FITNESS FOR A PARTICULAR PURPOSE. Libtool: ltmain.sh (GNU libtool) 1.4.2 (1.922.2.53 2001/09/11 03:18:52) Compiler: Reading specs from /usr/lib/gcc-lib/i386-redhat-linux/egcs-2.91.66/specs gcc version egcs-2.91.66 19990314/Linux (egcs-1.1.2 release) Bison: GNU Bison version 1.28 User's E-mail: ================================================================================ PHPINFO ================================================================================ phpinfo() PHP Version => 4.3.0 System => Linux support.netterm.com 2.2.14-6.1.1 #1 Thu Apr 13 20:01:58 EDT 2000 i686 Build Date => Jan 11 2003 12:23:51 Configure Command => './configure' '--with-apxs=/usr/sbin/apxs' '--with-mysql' '--with-zlib' '--with-pgsql' Server API => Command Line Interface Virtual Directory Support => disabled Configuration File (php.ini) Path => /usr/local/lib PHP API => 20020918 PHP Extension => 20020429 Zend Extension => 20021010 Debug Build => no Thread Safety => disabled Registered PHP Streams => php, http, ftp, compress.zlib This program makes use of the Zend Scripting Language Engine: Zend Engine v1.3.0, Copyright (c) 1998-2002 Zend Technologies _______________________________________________________________________ Configuration PHP Core Directive => Local Value => Master Value allow_call_time_pass_reference => On => On allow_url_fopen => On => On always_populate_raw_post_data => Off => Off arg_separator.input => &amp; => &amp; arg_separator.output => &amp; => &amp; asp_tags => Off => Off auto_append_file => no value => no value auto_prepend_file => no value => no value browscap => no value => no value default_charset => no value => no value default_mimetype => text/html => text/html define_syslog_variables => Off => Off disable_functions => no value => no value display_errors => On => On display_startup_errors => Off => Off doc_root => no value => no value docref_ext => no value => no value docref_root => http://www.php.net/ => http://www.php.net/ enable_dl => On => On error_append_string => no value => no value error_log => no value => no value error_prepend_string => no value => no value error_reporting => no value => no value expose_php => On => On extension_dir => /usr/local/lib/php/extensions/no-debug-non-zts-20020429 => /usr/local/lib/php/extensions/no-debug-non-zts-20020429 file_uploads => On => On gpc_order => GPC => GPC highlight.bg => #FFFFFF => #FFFFFF highlight.comment => #FF8000 => #FF8000 highlight.default => #0000BB => #0000BB highlight.html => #000000 => #000000 highlight.keyword => #007700 => #007700 highlight.string => #DD0000 => #DD0000 html_errors => Off => On ignore_repeated_errors => Off => Off ignore_repeated_source => Off => Off ignore_user_abort => Off => Off implicit_flush => On => Off include_path => .:/usr/local/lib/php => .:/usr/local/lib/php log_errors => Off => Off log_errors_max_len => 1024 => 1024 magic_quotes_gpc => On => On magic_quotes_runtime => Off => Off magic_quotes_sybase => Off => Off max_execution_time => 0 => 30 max_input_time => -1 => -1 open_basedir => no value => no value output_buffering => 0 => 0 output_handler => no value => no value post_max_size => 8M => 8M precision => 14 => 14 register_argc_argv => On => On register_globals => Off => Off report_memleaks => On => On safe_mode => Off => Off safe_mode_exec_dir => 1 => 1 safe_mode_gid => Off => Off safe_mode_include_dir => no value => no value sendmail_from => no value => no value sendmail_path => /usr/sbin/sendmail -t -i => /usr/sbin/sendmail -t -i short_open_tag => On => On SMTP => localhost => localhost smtp_port => 25 => 25 sql.safe_mode => Off => Off track_errors => Off => Off unserialize_callback_func => no value => no value upload_max_filesize => 2M => 2M upload_tmp_dir => no value => no value user_dir => no value => no value variables_order => no value => no value xmlrpc_error_number => 0 => 0 xmlrpc_errors => Off => Off y2k_compliance => On => On ctype ctype functions => enabled mysql MySQL Support => enabled Active Persistent Links => 0 Active Links => 0 Client API version => 3.23.49 MYSQL_MODULE_TYPE => builtin MYSQL_SOCKET => /tmp/mysql.sock MYSQL_INCLUDE => MYSQL_LIBS => Directive => Local Value => Master Value mysql.allow_persistent => On => On mysql.connect_timeout => -1 => -1 mysql.default_host => no value => no value mysql.default_password => no value => no value mysql.default_port => no value => no value mysql.default_socket => no value => no value mysql.default_user => no value => no value mysql.max_links => Unlimited => Unlimited mysql.max_persistent => Unlimited => Unlimited mysql.trace_mode => Off => Off overload User-Space Object Overloading Support => enabled pcre PCRE (Perl Compatible Regular Expressions) Support => enabled PCRE Library Version => 3.92 11-Sep-2002 pgsql PostgreSQL Support => enabled Active Persistent Links => 0 Active Links => 0 Directive => Local Value => Master Value pgsql.allow_persistent => On => On pgsql.auto_reset_persistent => Off => Off pgsql.ignore_notice => Off => Off pgsql.log_notice => Off => Off pgsql.max_links => Unlimited => Unlimited pgsql.max_persistent => Unlimited => Unlimited posix Revision => $Revision: 1.51 $ session Session Support => enabled Registered save handlers => files user Directive => Local Value => Master Value session.auto_start => Off => Off session.bug_compat_42 => On => On session.bug_compat_warn => On => On session.cache_expire => 180 => 180 session.cache_limiter => nocache => nocache session.cookie_domain => no value => no value session.cookie_lifetime => 0 => 0 session.cookie_path => / => / session.cookie_secure => Off => Off session.entropy_file => no value => no value session.entropy_length => 0 => 0 session.gc_dividend => 100 => 100 session.gc_maxlifetime => 1440 => 1440 session.gc_probability => 1 => 1 session.name => PHPSESSID => PHPSESSID session.referer_check => no value => no value session.save_handler => files => files session.save_path => /tmp => /tmp session.serialize_handler => php => php session.use_cookies => On => On session.use_only_cookies => Off => Off session.use_trans_sid => Off => Off standard Regex Library => Bundled library enabled Dynamic Library Support => enabled Path to sendmail => /usr/sbin/sendmail -t -i Directive => Local Value => Master Value assert.active => 1 => 1 assert.bail => 0 => 0 assert.callback => no value => no value assert.quiet_eval => 0 => 0 assert.warning => 1 => 1 auto_detect_line_endings => 0 => 0 default_socket_timeout => 60 => 60 safe_mode_allowed_env_vars => PHP_ => PHP_ safe_mode_protected_env_vars => LD_LIBRARY_PATH => LD_LIBRARY_PATH url_rewriter.tags => a=href,area=href,frame=src,form=,fieldset= => a=href,area=href,frame=src,form=,fieldset= user_agent => no value => no value tokenizer Tokenizer Support => enabled xml XML Support => active XML Namespace Support => active EXPAT Version => 1.95.2 zlib ZLib Support => enabled Compiled Version => 1.1.3 Linked Version => 1.1.3 Directive => Local Value => Master Value zlib.output_compression => Off => Off zlib.output_compression_level => -1 => -1 zlib.output_handler => no value => no value Additional Modules Module Name Environment Variable => Value LESSOPEN => |/usr/bin/lesspipe.sh %s IMAKEINCLUDE => -I/usr/lib/X11/config ENV => /home/zkrr01/.kshrc GSI_INSTALL_PATH => /usr/local/gsi REDIRECT_STATUS => VAR_ACE => /var/ace SCRIPT_FILENAME => HISTSIZE => 1000 HOSTNAME => support.netterm.com POSTGRES_INCLUDE => /usr/local/pgsql/include LOGNAME => zkrr01 CC => gcc GLOBUS_LOCATION => /usr/local/gsi SSH_TTY => /dev/pts/0 LD_LIBRARY_PATH => :/usr/local/lib:/usr/kerberos/lib:/usr/local/gsi/lib:/usr/local/mysql/lib/mysql MAIL => /var/spool/mail/zkrr01 CONTENT_TYPE => PAGER => less CVS_RSH => /usr/local/bin/ssh SSH_CONNECTION => 205.166.252.13 3708 205.166.252.9 22 TERM => xterm TEST_PHP_EXECUTABLE => /home/zkrr01/php-4.3.0/sapi/cli/php HOSTTYPE => i386 KDEDIR => /usr PATH => /home/zkrr01:/home/zkrr01/bin:/home/zkrr01/CA:/home/zkrr01/vnc:/bin:/usr/bin:/usr/local/ssl/bin:/usr/kerberos/bin:/usr/kerberos/sbin:/usr/bin:/usr/local/bin:/usr/include:/usr/X11R6/bin:/usr/local/sbin:/usr/local/pgsql/bin:/usr/local/gsi/bin:/usr/local/gsi/sbin:/usr/local/gsi/tools/i686-pc-linux-gnu/bin:/usr/local/gsi/tools/i686-pc-linux-gnu/sbin:/usr/local/mysql/bin:/usr/local/mysql/bin HOME => /home/zkrr01 INPUTRC => /etc/inputrc TEST_PHP_SRCDIR => /home/zkrr01/php-4.3.0 REQUEST_METHOD => SHELL => /bin/sh QUERY_STRING => GLOBUS_SSL_PATH => /usr/local/gsi/ssl USER => zkrr01 ICSPATH => /opt/ics MANPATH => :/usr/local/pgsql/man OPENSSL_CONF => /usr/local/ssl/openssl.cnf BLOCKSIZE => 1k X509_USER_PROXY => /home/zkrr01/.globus/proxy QTDIR => /usr/lib/qt-2.1.0 DISPLAY => localhost:10.0 POSTGRES_LIB => /usr/local/pgsql/lib LANG => en_US MAKEFLAGS => THE_MACRO_PATH => :/usr/local/THE SSH_CLIENT => 205.166.252.13 3708 22 OSTYPE => Linux _ => /home/zkrr01/php-4.3.0/sapi/cli/php MAKELEVEL => 1 SHLVL => 3 EDITOR => pico LS_COLORS => no=00:fi=00:di=01;34:ln=01;36:pi=40;33:so=01;35:bd=40;33;01:cd=40;33;01:or=01;05;37;41:mi=01;05;37;41:ex=01;32:*.cmd=01;32:*.exe=01;36:*.com=01;32:*.btm=01;32:*.bat=01;32:*.sh=01;32:*.csh=01;32:*.tar=01;31:*.tgz=01;31:*.arj=01;31:*.taz=01;31:*.lzh=01;31:*.zip=01;31:*.z=01;31:*.Z=01;31:*.gz=01;31:*.bz2=01;31:*.bz=01;31:*.tz=01;31:*.rpm=01;31:*.cpio=01;31:*.jpg=01;35:*.gif=01;35:*.bmp=01;35:*.xbm=01;35:*.xpm=01;35:*.png=01;35:*.tif=01;35: CONTENT_LENGTH => MFLAGS => CVSROOT => anoncvs@anoncvs5.usa.openbsd.org:/cvs PATH_TRANSLATED => PHP Variables Variable => Value _SERVER["LESSOPEN"] => |/usr/bin/lesspipe.sh %s _SERVER["IMAKEINCLUDE"] => -I/usr/lib/X11/config _SERVER["ENV"] => /home/zkrr01/.kshrc _SERVER["GSI_INSTALL_PATH"] => /usr/local/gsi _SERVER["REDIRECT_STATUS"] => _SERVER["VAR_ACE"] => /var/ace _SERVER["SCRIPT_FILENAME"] => _SERVER["HISTSIZE"] => 1000 _SERVER["HOSTNAME"] => support.netterm.com _SERVER["POSTGRES_INCLUDE"] => /usr/local/pgsql/include _SERVER["LOGNAME"] => zkrr01 _SERVER["CC"] => gcc _SERVER["GLOBUS_LOCATION"] => /usr/local/gsi _SERVER["SSH_TTY"] => /dev/pts/0 _SERVER["LD_LIBRARY_PATH"] => :/usr/local/lib:/usr/kerberos/lib:/usr/local/gsi/lib:/usr/local/mysql/lib/mysql _SERVER["MAIL"] => /var/spool/mail/zkrr01 _SERVER["CONTENT_TYPE"] => _SERVER["PAGER"] => less _SERVER["CVS_RSH"] => /usr/local/bin/ssh _SERVER["SSH_CONNECTION"] => 205.166.252.13 3708 205.166.252.9 22 _SERVER["TERM"] => xterm _SERVER["TEST_PHP_EXECUTABLE"] => /home/zkrr01/php-4.3.0/sapi/cli/php _SERVER["HOSTTYPE"] => i386 _SERVER["KDEDIR"] => /usr _SERVER["PATH"] => /home/zkrr01:/home/zkrr01/bin:/home/zkrr01/CA:/home/zkrr01/vnc:/bin:/usr/bin:/usr/local/ssl/bin:/usr/kerberos/bin:/usr/kerberos/sbin:/usr/bin:/usr/local/bin:/usr/include:/usr/X11R6/bin:/usr/local/sbin:/usr/local/pgsql/bin:/usr/local/gsi/bin:/usr/local/gsi/sbin:/usr/local/gsi/tools/i686-pc-linux-gnu/bin:/usr/local/gsi/tools/i686-pc-linux-gnu/sbin:/usr/local/mysql/bin:/usr/local/mysql/bin _SERVER["HOME"] => /home/zkrr01 _SERVER["INPUTRC"] => /etc/inputrc _SERVER["TEST_PHP_SRCDIR"] => /home/zkrr01/php-4.3.0 _SERVER["REQUEST_METHOD"] => _SERVER["SHELL"] => /bin/sh _SERVER["QUERY_STRING"] => _SERVER["GLOBUS_SSL_PATH"] => /usr/local/gsi/ssl _SERVER["USER"] => zkrr01 _SERVER["ICSPATH"] => /opt/ics _SERVER["MANPATH"] => :/usr/local/pgsql/man _SERVER["OPENSSL_CONF"] => /usr/local/ssl/openssl.cnf _SERVER["BLOCKSIZE"] => 1k _SERVER["X509_USER_PROXY"] => /home/zkrr01/.globus/proxy _SERVER["QTDIR"] => /usr/lib/qt-2.1.0 _SERVER["DISPLAY"] => localhost:10.0 _SERVER["POSTGRES_LIB"] => /usr/local/pgsql/lib _SERVER["LANG"] => en_US _SERVER["MAKEFLAGS"] => _SERVER["THE_MACRO_PATH"] => :/usr/local/THE _SERVER["SSH_CLIENT"] => 205.166.252.13 3708 22 _SERVER["OSTYPE"] => Linux _SERVER["_"] => /home/zkrr01/php-4.3.0/sapi/cli/php _SERVER["MAKELEVEL"] => 1 _SERVER["SHLVL"] => 3 _SERVER["EDITOR"] => pico _SERVER["LS_COLORS"] => no=00:fi=00:di=01;34:ln=01;36:pi=40;33:so=01;35:bd=40;33;01:cd=40;33;01:or=01;05;37;41:mi=01;05;37;41:ex=01;32:*.cmd=01;32:*.exe=01;36:*.com=01;32:*.btm=01;32:*.bat=01;32:*.sh=01;32:*.csh=01;32:*.tar=01;31:*.tgz=01;31:*.arj=01;31:*.taz=01;31:*.lzh=01;31:*.zip=01;31:*.z=01;31:*.Z=01;31:*.gz=01;31:*.bz2=01;31:*.bz=01;31:*.tz=01;31:*.rpm=01;31:*.cpio=01;31:*.jpg=01;35:*.gif=01;35:*.bmp=01;35:*.xbm=01;35:*.xpm=01;35:*.png=01;35:*.tif=01;35: _SERVER["CONTENT_LENGTH"] => _SERVER["MFLAGS"] => _SERVER["CVSROOT"] => anoncvs@anoncvs5.usa.openbsd.org:/cvs _SERVER["PATH_TRANSLATED"] => _SERVER["PHP_SELF"] => _SERVER["SCRIPT_NAME"] => _SERVER["DOCUMENT_ROOT"] => _SERVER["argv"] => Array ( ) _SERVER["argc"] => 0 _ENV["LESSOPEN"] => |/usr/bin/lesspipe.sh %s _ENV["IMAKEINCLUDE"] => -I/usr/lib/X11/config _ENV["ENV"] => /home/zkrr01/.kshrc _ENV["GSI_INSTALL_PATH"] => /usr/local/gsi _ENV["REDIRECT_STATUS"] => _ENV["VAR_ACE"] => /var/ace _ENV["SCRIPT_FILENAME"] => _ENV["HISTSIZE"] => 1000 _ENV["HOSTNAME"] => support.netterm.com _ENV["POSTGRES_INCLUDE"] => /usr/local/pgsql/include _ENV["LOGNAME"] => zkrr01 _ENV["CC"] => gcc _ENV["GLOBUS_LOCATION"] => /usr/local/gsi _ENV["SSH_TTY"] => /dev/pts/0 _ENV["LD_LIBRARY_PATH"] => :/usr/local/lib:/usr/kerberos/lib:/usr/local/gsi/lib:/usr/local/mysql/lib/mysql _ENV["MAIL"] => /var/spool/mail/zkrr01 _ENV["CONTENT_TYPE"] => _ENV["PAGER"] => less _ENV["CVS_RSH"] => /usr/local/bin/ssh _ENV["SSH_CONNECTION"] => 205.166.252.13 3708 205.166.252.9 22 _ENV["TERM"] => xterm _ENV["TEST_PHP_EXECUTABLE"] => /home/zkrr01/php-4.3.0/sapi/cli/php _ENV["HOSTTYPE"] => i386 _ENV["KDEDIR"] => /usr _ENV["PATH"] => /home/zkrr01:/home/zkrr01/bin:/home/zkrr01/CA:/home/zkrr01/vnc:/bin:/usr/bin:/usr/local/ssl/bin:/usr/kerberos/bin:/usr/kerberos/sbin:/usr/bin:/usr/local/bin:/usr/include:/usr/X11R6/bin:/usr/local/sbin:/usr/local/pgsql/bin:/usr/local/gsi/bin:/usr/local/gsi/sbin:/usr/local/gsi/tools/i686-pc-linux-gnu/bin:/usr/local/gsi/tools/i686-pc-linux-gnu/sbin:/usr/local/mysql/bin:/usr/local/mysql/bin _ENV["HOME"] => /home/zkrr01 _ENV["INPUTRC"] => /etc/inputrc _ENV["TEST_PHP_SRCDIR"] => /home/zkrr01/php-4.3.0 _ENV["REQUEST_METHOD"] => _ENV["SHELL"] => /bin/sh _ENV["QUERY_STRING"] => _ENV["GLOBUS_SSL_PATH"] => /usr/local/gsi/ssl _ENV["USER"] => zkrr01 _ENV["ICSPATH"] => /opt/ics _ENV["MANPATH"] => :/usr/local/pgsql/man _ENV["OPENSSL_CONF"] => /usr/local/ssl/openssl.cnf _ENV["BLOCKSIZE"] => 1k _ENV["X509_USER_PROXY"] => /home/zkrr01/.globus/proxy _ENV["QTDIR"] => /usr/lib/qt-2.1.0 _ENV["DISPLAY"] => localhost:10.0 _ENV["POSTGRES_LIB"] => /usr/local/pgsql/lib _ENV["LANG"] => en_US _ENV["MAKEFLAGS"] => _ENV["THE_MACRO_PATH"] => :/usr/local/THE _ENV["SSH_CLIENT"] => 205.166.252.13 3708 22 _ENV["OSTYPE"] => Linux _ENV["_"] => /home/zkrr01/php-4.3.0/sapi/cli/php _ENV["MAKELEVEL"] => 1 _ENV["SHLVL"] => 3 _ENV["EDITOR"] => pico _ENV["LS_COLORS"] => no=00:fi=00:di=01;34:ln=01;36:pi=40;33:so=01;35:bd=40;33;01:cd=40;33;01:or=01;05;37;41:mi=01;05;37;41:ex=01;32:*.cmd=01;32:*.exe=01;36:*.com=01;32:*.btm=01;32:*.bat=01;32:*.sh=01;32:*.csh=01;32:*.tar=01;31:*.tgz=01;31:*.arj=01;31:*.taz=01;31:*.lzh=01;31:*.zip=01;31:*.z=01;31:*.Z=01;31:*.gz=01;31:*.bz2=01;31:*.bz=01;31:*.tz=01;31:*.rpm=01;31:*.cpio=01;31:*.jpg=01;35:*.gif=01;35:*.bmp=01;35:*.xbm=01;35:*.xpm=01;35:*.png=01;35:*.tif=01;35: _ENV["CONTENT_LENGTH"] => _ENV["MFLAGS"] => _ENV["CVSROOT"] => anoncvs@anoncvs5.usa.openbsd.org:/cvs _ENV["PATH_TRANSLATED"] => PHP License This program is free software; you can redistribute it and/or modify it under the terms of the PHP License as published by the PHP Group and included in the distribution in the file: LICENSE This program is distributed in the hope that it will be useful, but WITHOUT ANY WARRANTY; without even the implied warranty of MERCHANTABILITY or FITNESS FOR A PARTICULAR PURPOSE. If you did not receive a copy of the PHP license, or have any questions about PHP licensing, please contact license@php.net.

« previous php.qa (#7967) next »