Error whilst compiling current CVS with java support
| From: | Yusuf Goolamabbas | Date: | Tue, 15 Feb 2000 13:49:20 +0000 |
| Subject: | Error whilst compiling current CVS with java support | ||
| Groups: | php.version4 | ||
| Request: | Send a blank email to php-version4+get-10293@lists.php.net to get a copy of this message | ||
Platform, Linux 2.2.12 / redhat 6.0
Sources in /usr/local/src/{php4,Zend,TSRM}
Build tree in /usr/local/src/phpbuild
Running the following configure command
../php4/configure --with-apache=/usr/local/src/apache_1.3.9 \
--with-mysql=/usr/local/site/mysql --enable-track-vars \
--enable-magic-quotes \
--with-db2=/usr/local/site/BerkeleyDB \
--with-ldap=/usr/local/site/ldap \
--with-java=/usr/local/site/jdk118 \
--disable-debug --with-config-file-path=/usr/local/site/ \
--prefix=/usr/local/site/php
results in the following error
Making shared in java
make[2]: Entering directory `/usr/local/src/phpbuild/ext/java'
make[3]: Entering directory `/usr/local/src/phpbuild/ext/java'
cp: reflect.java: No such file or directory
make[3]: *** [php_java.jar] Error 1
make[3]: Leaving directory `/usr/local/src/phpbuild/ext/java'
make[2]: *** [shared] Error 2
make[2]: Leaving directory `/usr/local/src/phpbuild/ext/java'
make[1]: *** [all] Error 1
make[1]: Leaving directory `/usr/local/src/phpbuild/ext'
make: *** [all-recursive] Error 1
--
Yusuf Goolamabbas
yusufg@outblaze.com