Solaris 8 + php4beta4w/ mysql support + apache 1.3.12 == compile challenged !!

From: Date: Mon, 28 Feb 2000 22:39:13 +0000
Subject: Solaris 8 + php4beta4w/ mysql support + apache 1.3.12 == compile challenged !!
References: 1  Groups: php.version4 
Request: Send a blank email to php-version4+get-11158@lists.php.net to get a copy of this message
Has anyone else noticed this ... or am I the only one running Solaris 8. check out the output. gcc -c -I./os/unix -I./include -DSOLARIS2=280 -I/export/home/root/php-4 1 -I/export/home/root/php-4.0b4pl1/Zend -I/export/home/root/php-4.0b4pl1/Z /export/home/root/php-4.0b4pl1 -DUSE_EXPAT -I./lib/expat-lite -DNO_DL_NEED apaci` modules.c gcc -c -I./os/unix -I./include -DSOLARIS2=280 -I/export/home/root/php-4 1 -I/export/home/root/php-4.0b4pl1/Zend -I/export/home/root/php-4.0b4pl1/Z /export/home/root/php-4.0b4pl1 -DUSE_EXPAT -I./lib/expat-lite -DNO_DL_NEED apaci` buildmark.c gcc -DSOLARIS2=280 -I/export/home/root/php-4.0b4pl1 -I/export/home/root/p b4pl1/Zend -I/export/home/root/php-4.0b4pl1/Zend -I/export/home/root/php-4 1 -DUSE_EXPAT -I./lib/expat-lite -DNO_DL_NEEDED ./apaci \ -o httpd buildmark.o modules.o modules/php4/libphp4.a modules/standa standard.a main/libmain.a ./os/unix/libos.a ap/libap.a lib/expat-lite/lib a -R/usr/local/mysql/lib/mysql -L/usr/local/mysql/lib/mysql -Lmodules/ph ./modules/php4 -L../../modules/php4 -lmodphp4 -lpam -ldl -ldl -lresol solv -lm -lsocket -lsocket -lnsl Undefined first referenced symbol in file mysql_get_client_info modules/php4/libphp4.a(php_mysql.o) mysql_drop_db modules/php4/libphp4.a(php_mysql.o) mysql_close modules/php4/libphp4.a(php_mysql.o) mysql_fetch_lengths modules/php4/libphp4.a(php_mysql.o) mysql_free_result modules/php4/libphp4.a(php_mysql.o) mysql_create_db modules/php4/libphp4.a(php_mysql.o) mysql_field_seek modules/php4/libphp4.a(php_mysql.o) mysql_list_fields modules/php4/libphp4.a(php_mysql.o) mysql_fetch_row modules/php4/libphp4.a(php_mysql.o) mysql_real_query modules/php4/libphp4.a(php_mysql.o) mysql_real_connect modules/php4/libphp4.a(php_mysql.o) mysql_stat modules/php4/libphp4.a(php_mysql.o) mysql_fetch_field modules/php4/libphp4.a(php_mysql.o) mysql_list_dbs modules/php4/libphp4.a(php_mysql.o) mysql_select_db modules/php4/libphp4.a(php_mysql.o) mysql_store_result modules/php4/libphp4.a(php_mysql.o) mysql_list_tables modules/php4/libphp4.a(php_mysql.o) mysql_data_seek modules/php4/libphp4.a(php_mysql.o) mysql_init modules/php4/libphp4.a(php_mysql.o) ld: fatal: Symbol referencing errors. No output written to httpd collect2: ld returned 1 exit status make[2]: *** [target_static] Error 1 make[2]: Leaving directory `/export/home/root/apache_1.3.12/src' make[1]: *** [build-std] Error 2 make[1]: Leaving directory `/export/home/root/apache_1.3.12' make: *** [build] Error 2

« previous php.version4 (#11158) next »