latest cvs compilation dies at crypt.c

From: Date: Mon, 28 Feb 2000 23:05:11 +0000
Subject: latest cvs compilation dies at crypt.c
Groups: php.version4 
Request: Send a blank email to php-version4+get-11159@lists.php.net to get a copy of this message
My info: Linux www 2.2.12-20smp #1 SMP Mon Sep 27 10:34:45 EDT 1999 i686 unknown php4 cvs gcc -DHAVE_CONFIG_H -I. -I/usr/local/cvs/php4/ext/standard -I../.. -I../../Zend -I/usr/local/cvs/php4 -I/usr/local/apache/src/include -I/usr/local/apache/src/os/unix -I/usr/local/include -I/usr/local/include/mysql -D_REENTRANT -g -O2 -c crypt.c && touch crypt.lo crypt.c: In function `php_minit_crypt': crypt.c:102: `PHP_STD_DES_CRYPT' undeclared (first use in this function) crypt.c:102: (Each undeclared identifier is reported only once crypt.c:102: for each function it appears in.) crypt.c:103: `PHP_EXT_DES_CRYPT' undeclared (first use in this function) crypt.c:104: `PHP_MD5_CRYPT' undeclared (first use in this function) crypt.c:105: `PHP_BLOWFISH_CRYPT' undeclared (first use in this function) crypt.c: In function `php_if_crypt': crypt.c:120: `PHP_MAX_SALT_LEN' undeclared (first use in this function) crypt.c:120: size of array `salt' has non-integer type make[3]: *** [crypt.lo] Error 1 make[3]: Leaving directory `/usr/local/cvs/php4/ext/standard' make[2]: *** [all-recursive] Error 1 make[2]: Leaving directory `/usr/local/cvs/php4/ext/standard' make[1]: *** [all] Error 1 make[1]: Leaving directory `/usr/local/cvs/php4/ext' make: *** [all-recursive] Error 1 -- Vincent Stoessel - Corporate Accounts, Manager vince@digex.net - 301 847 6548 (direct) 301 847 5082 (fax) 24-hour Support Line - 301 847 5200 or 1 800 969 9090 Intermedia Communications Business Internet

« previous php.version4 (#11159) next »