build fail on basic_functions.c in current snapshot

From: Date: Tue, 07 Mar 2000 20:53:09 +0000
Subject: build fail on basic_functions.c in current snapshot
Groups: php.version4 
Request: Send a blank email to php-version4+get-11715@lists.php.net to get a copy of this message
Hi, I'm compiling off of a snap shot from 9:45 am this morning. I get the following error.... gcc -DHAVE_CONFIG_H -I. -I/opt/baygate/www/apache/php4-200003070945/ext/stan dard -I../.. -I../../Zend -I/opt/baygate/www/apache/php4-200003070945 -I/usr/loc al/i nclude -I/opt/informix/prod/incl/esql -I/opt/baygate/www/apache/php4-2000030 7094 5/ext/xml/expat/xmltok -I/opt/baygate/www/apache/php4-200003070945/ext/xml/e xpat /xmlparse -DXML_BYTE_ORDER=21 -D_POSIX_PTHREAD_SEMANTICS -D_REENTRANT -g -W all -c basic_functions.c && touch basic_functions.lo basic_functions.c:323: `php_if_dl' undeclared here (not in a function) basic_functions.c:323: initializer element for `basic_functions[200].handler' is not constant basic_functions.c: In function `php_info_basic': basic_functions.c:707: warning: implicit declaration of function `php_info_dl' make[3]: *** [basic_functions.lo] Error 1 make[3]: Leaving directory `/opt/baygate/www/apache/php4-200003070945/ext/standa rd' make[2]: *** [all-recursive] Error 1 make[2]: Leaving directory `/opt/baygate/www/apache/php4-200003070945/ext/standa rd' make[1]: *** [all] Error 1 make[1]: Leaving directory `/opt/baygate/www/apache/php4-200003070945/ext' make: *** [all-recursive] Error 1

« previous php.version4 (#11715) next »