Re: [PHP4BETA] build fail on basic_functions.c in current snapshot
| From: | Stig Bakken | Date: | Wed, 08 Mar 2000 23:07:10 +0000 |
| Subject: | Re: [PHP4BETA] build fail on basic_functions.c in current snapshot | ||
| References: | 1 | Groups: | php.version4 |
| Request: | Send a blank email to php-version4+get-11789@lists.php.net to get a copy of this message | ||
The snap was probably shot while I was still hacking that. Try CVS or a
newer snapshot.
- Stig
Peter Kocks wrote:
>
> Hi,
>
> I'm compiling off of a snap shot from 9:45 am this morning.
>
> I get the following error....
>
> gcc -DHAVE_CONFIG_H -I. -I/opt/baygate/www/apache/php4-200003070945/ext/stan
> dard
> -I../.. -I../../Zend -I/opt/baygate/www/apache/php4-200003070945 -I/usr/loc
> al/i
> nclude -I/opt/informix/prod/incl/esql -I/opt/baygate/www/apache/php4-2000030
> 7094
> 5/ext/xml/expat/xmltok -I/opt/baygate/www/apache/php4-200003070945/ext/xml/e
> xpat
> /xmlparse -DXML_BYTE_ORDER=21 -D_POSIX_PTHREAD_SEMANTICS -D_REENTRANT -g -W
> all
> -c basic_functions.c && touch basic_functions.lo
> basic_functions.c:323: `php_if_dl' undeclared here (not in a function)
> basic_functions.c:323: initializer element for
> `basic_functions[200].handler' is
> not constant
> basic_functions.c: In function `php_info_basic':
> basic_functions.c:707: warning: implicit declaration of function
> `php_info_dl'
> make[3]: *** [basic_functions.lo] Error 1
> make[3]: Leaving directory
> `/opt/baygate/www/apache/php4-200003070945/ext/standa
> rd'
> make[2]: *** [all-recursive] Error 1
> make[2]: Leaving directory
> `/opt/baygate/www/apache/php4-200003070945/ext/standa
> rd'
> make[1]: *** [all] Error 1
> make[1]: Leaving directory `/opt/baygate/www/apache/php4-200003070945/ext'
> make: *** [all-recursive] Error 1
>
> --
> PHP 4.0 Beta Mailing List <http://www.php.net/version4/>
> To unsubscribe, e-mail: php4beta-unsubscribe@lists.php.net
> For additional commands, e-mail: php4beta-help@lists.php.net
> To contact the list administrators, e-mail: php4beta-admin@lists.php.net