4.0b1 Cant' compile on Suse6.1

From: Date: Tue, 27 Jul 1999 12:44:40 +0000
Subject: 4.0b1 Cant' compile on Suse6.1
Groups: php.version4 
Request: Send a blank email to php-version4+get-2836@lists.php.net to get a copy of this message
Could someone give me a clue as to what this error means and how I might go about correcting the problem. I'm compiling PHP4.0b1 as an apache module (apache 1.3.6) on Suse Linux 6.1. I get a similar error when trying to compile PHP3.0.11. gcc -c -I../os/unix -I../include -DLINUX=2 -I/usr/src/php-4.0b1 -I/usr/src/ph p-4.0b1/libzend -I/usr/src/php-4.0b1/libzend -I/usr/src/php-4.0b1 -DUSE_HSREGEX ../apaci util.c util.c: In function `ap_find_token': util.c:1292: `test_char_table' undeclared (first use in this function) util.c:1292: (Each undeclared identifier is reported only once util.c:1292: for each function it appears in.) util.c:1292: `T_HTTP_TOKEN_STOP' undeclared (first use in this function) util.c: In function `ap_escape_shell_cmd': util.c:1351: `test_char_table' undeclared (first use in this function) util.c:1351: `T_ESCAPE_SHELL_CMD' undeclared (first use in this function) util.c: In function `ap_escape_path_segment': util.c:1475: `test_char_table' undeclared (first use in this function) util.c:1475: `T_ESCAPE_PATH_SEGMENT' undeclared (first use in this function) util.c: In function `ap_os_escape_path': util.c:1504: `test_char_table' undeclared (first use in this function) util.c:1504: `T_OS_ESCAPE_PATH' undeclared (first use in this function) make[3]: *** [util.o] Error 1 make[2]: *** [subdirs] Error 1 make[2]: Leaving directory `/usr/src/apache_1.3.6/src' make[1]: *** [build-std] Error 2 make[1]: Leaving directory `/usr/src/apache_1.3.6' make: *** [build] Error 2 Geoffrey Makstutis ------------------------------------ 51% Studios Ltd Architecture - Design 1-5 Clerkenwell Road London EC1M 5PA gmak@51pct.com -------------------------------------

« previous php.version4 (#2836) next »