php4b2+apache1.3.9 help
| From: | Scott Collins | Date: | Sun, 22 Aug 1999 16:00:46 +0000 |
| Subject: | php4b2+apache1.3.9 help | ||
| Groups: | php.version4 | ||
| Request: | Send a blank email to php-version4+get-3638@lists.php.net to get a copy of this message | ||
I`m trying to install php4b2 on a RedHat 6.0 system. Because the RedHat
install didn`t include Apache configureation files I removed them and
downloaded
Apache 1.3.9. While following the directions in the php4b2 INSTALL file,
at the step where I
make apache after configuring it with php, I get
the following error at the end of the script:
gcc -DLINUX=2 -I/usr/local/php -I/usr/local/php/libzend -I/usr/local/php/li
bzend
-I/usr/local/php -DUSE_HSREGEX -DUSE_EXPAT -I./lib/expat-lite ./apaci
-o httpd buildmark.o modules.o modules/standard/libstandard.a
modules/php4/libphp4.a
main/libmain.a ./os/unix/libos.a ap/libap.a regex/libregex.a
lib/expat-lite/libexpat.a
-Wl,-rpath,/usr/lib/mysql -Lmodules/php4 -L../modules/php4 -L../../modules/
php4
-lmodphp4 -L/usr/local/php/ext/pcre/pcrelib -lpcre -L/usr/local/php/regex
-lregex -lgdbm -L/usr/lib/mysql -lmysqlclient -lpam -ldl -lgd -lm
-lcrypt -lnsl -lresolv -rdynamic -lm -lcrypt
modules/php4/libphp4.a(ext_standard_basic_functions.o): In function
php3_getenv:
/usr/local/php/ext/standard/basic_functions.c:484: undefined reference to
table_get
modules/php4/libphp4.a(ext_standard_basic_functions.o): In function
php3_flush
/usr/local/php/ext/standard/basic_functions.c:1231: undefined reference to
rflush
collect2: ld returned 1 exit statusmake[2]: *** [target_static] Error 1
make[2]: Leaving directory /usr/local/apache/src
make[1]: *** [build-std] Error 2make[1]: Leaving directory
/usr/local/apache
make: *** [build] Error 2
Any ideas where these missing functions are?
thanks,
scott