Problem compiling php-4.0b3-RC3 on Intel
| From: | Richard Feather | Date: | Tue, 09 Nov 1999 14:33:19 +0000 |
| Subject: | Problem compiling php-4.0b3-RC3 on Intel | ||
| Groups: | php.version4 | ||
| Request: | Send a blank email to php-version4+get-6010@lists.php.net to get a copy of this message | ||
Okay, Apache 1.3.9, b3-RC3, Linux-Mandrake 6.0.
Configure:
with-mysql, with-xml, enable-track-vars
When I run make, the process gets into libzend, reaches zend-scanner.c and I receive the following error:
In file included from /usr/include/bits/errno.h:25,
from /usr/include/errno.h:36,
from ./zend-scanner.1:41:
/usr/include/linux/errno.h:4: asm/errno.h: No such file or directory
make[2]: *** [zend-scanner.lo] Error 1
make[2]: Leaving directory `/storage/php-4.0b3-RC3/libzend'
make[1]: *** [all-recursive] Error 1
make[1]: Leaving directory `/storage/php-4.0b3-RC3'
make: *** [all-recursive-am] Error 2
Thanks.
______________________________________________________
Get Your Private, Free Email at http://www.hotmail.com