Re: [PHP4BETA] RC5 Compile problem

From: Date: Tue, 16 Nov 1999 05:46:27 +0000
Subject: Re: [PHP4BETA] RC5 Compile problem
Groups: php.version4 
Request: Send a blank email to php-version4+get-6281@lists.php.net to get a copy of this message
At 07:03 AM 16/11/99 +0200, you wrote: >Compile with --disable-inline. > That worked. Compiled fine. Now I get /usr/sbin/apachectl start: httpd could not be started configtest shows the conf file syntax is good. :) Mike > >At 11:51 PM 11/15/99 -0500, Mike Robinson wrote: >>Hi, >> >>Just playing around, I have 3.0.12 working nicely by itself. >>I recompiled 3.0.12 with versioning enabled. No problems there. >>I downloaded the rc5 src, untarred it and configured thus: >> >>./configure --with-apxs=/usr/sbin/apxs --with-mysql --with-zlib >>--enable-versioning >> >>(Same config line used with php-3.0.12) >>No problems. >>Then running 'make', I got... >> >>[root@linuxbox php-4_0b3_RC5]# make >>make all-recursive >>make[1]: Entering directory `/usr/src/php-4_0b3_RC5' >>Making all in libzend >>make[2]: Entering directory `/usr/src/php-4_0b3_RC5/libzend' >>/bin/sh ./libtool --silent --mode=compile gcc -DHAVE_CONFIG_H -I. >>-I/usr/src/php-4_0b3_RC5/./libzend -I. -g -O2 -g -c zend_execute.c >>zend_execute.c: In function `execute': >>zend_execute.c:2118: virtual memory exhausted >>make[2]: *** [zend_execute.lo] Error 1 >>make[2]: Leaving directory `/usr/src/php-4_0b3_RC5/libzend' >>make[1]: *** [all-recursive] Error 1 >>make[1]: Leaving directory `/usr/src/php-4_0b3_RC5' >>make: *** [all-recursive-am] Error 2 >> >> >>================================= >> >>Attempts to add additional swapfile space yielded a longer wait time until >>the same message appeared. >> >> >>System: RedHat 6.0, Pentium 200, 64megs, not production box with zero load. >>Apache: 1.3.9 >>Bin-utils: 2.9.4.0.6-1

« previous php.version4 (#6281) next »