Bug #17757 Updated: Php compile generate error:/usr/bin/ld:cannot find -lclntsh

From: Date: Wed, 19 Jun 2002 23:56:47 +0000
Subject: Bug #17757 Updated: Php compile generate error:/usr/bin/ld:cannot find -lclntsh
References: 1  Groups: php.bugs 
Request: Send a blank email to php-bugs+get-11474@lists.php.net to get a copy of this message
ID: 17757 Updated by: Palvin@163.com Reported By: Palvin@163.com -Status: Feedback +Status: Open Bug Type: OCI8 related Operating System: RedHat 7.3+Oracle 8i/9i PHP Version: 4.2.1 New Comment: Sorry, I've tried many times and can't successfulness! I hope next version will resolve the problem. Previous Comments: ------------------------------------------------------------------------ [2002-06-18 21:23:05] sniper@php.net Try dropping that last option out (--with-oracle) as the oci8 is the one you should be using anyway.. ------------------------------------------------------------------------ [2002-06-18 20:18:37] Palvin@163.com ./configure i386-redhat-linux --prefix=/usr --exec-prefix=/usr --bindir=/usr/bin --sbindir=/usr/sbin --sysconfdir=/etc --datadir=/usr/share --includedir=/usr/include --libdir=/usr/lib --libexecdir=/usr/libexec --localstatedir=/var --sharedstatedir=/usr/com --mandir=/usr/share/man --infodir=/usr/share/info --prefix=/usr --with-config-file-path=/etc --enable-force-cgi-redirect --disable-debug --enable-dbg=shared --with-dbg-profiler --enable-pic --disable-rpath --enable-inline-optimization --with-bz2 --with-db3 --with-curl --with-dom=/usr --with-exec-dir=/usr/bin --with-freetype-dir=/usr --with-png-dir=/usr --with-gd --enable-gd-native-ttf --with-ttf --with-gdbm --with-gettext --with-ncurses --with-gmp --with-iconv --with-jpeg-dir=/usr --with-mm --with-openssl --with-png --with-pspell --with-regex=system --with-xml --with-expat-dir=/usr --with-zlib --with-layout=GNU --enable-bcmath --enable-debugger --enable-exif --enable-ftp --enable-magic-quotes --enable-safe-mode --enable-sockets --enable-sysvsem --enable-sysvshm --enable-discard-path --enable-track-vars --enable-trans-sid --enable-yp --enable-wddx --with-imap=shared --with-imap-ssl --with-kerberos=/usr/kerberos --with-ldap=shared --with-mysql=shared,/usr --with-pgsql=shared --with-snmp=shared,/usr --with-snmp=shared --enable-ucd-snmp-hack --with-unixODBC=shared --enable-memory-limit --enable-bcmath --enable-shmop --enable-versioning --enable-calendar --enable-dbx --enable-dio --enable-mcal --enable-mbstring --enable-mbstr-enc-trans --with-apxs=/usr/sbin/apxs --with-oci8=/u01/app/oracle/product/9.0.1 --with-oracle=/u01/app/oracle/product/9.0.1 Hi, this is my configure, except the last two parameters, all others parameter was copy from result of phpinfo(), my database home is /u01/app/oracle/product/9.0.1 and my os is RedHat 7.3. When I make it, the error is show: /usr/bin/ld: cannot find -lclntsh collect2: ld returned 1 exit status make: *** [libphp4.la] Error 1 ------------------------------------------------------------------------ [2002-06-18 02:24:07] sniper@php.net Do you happen to have the paths to both to the oracle libraries and mysql libraries specified in /etc/ld.so.conf ?? e.g. I have /home/ora_user/OraHome1/lib in there.. If not, add them and run /sbin/ldconfig If this helps, close this report, otherwise, you need to tell us your whole configure line used to configure PHP and also add the couple of lines BEFORE that error you get. btw. if ORACLE_HOME is set correctly, you don't have to put any path for --with-oci8 --Jani ------------------------------------------------------------------------ [2002-06-18 01:58:44] Palvin@163.com I'm sorry to tell you that the problem is exist still. When I download the file which your refer to, the report became: /usr/bin/ld: cannot find -lmysqlclient collect2: ld returned 1 exit status make: *** [libphp4.la] Error1. When I get rid of parameter --with-mysql=shared,/usr then the report was below: /usr/bin/ld: cannot find -lclntsh collect2: ld returned 1 exit status make: *** [libphp4.la] Error 1 I think the error should be cause of glibc library, because I use RedHat 7.1 have none of any error. ------------------------------------------------------------------------ [2002-06-15 20:28:49] sniper@php.net Could you please try the latest CVS snapshot: http://snaps.php.net/php4-latest.tar.gz I think this is already fixed. Configure is just detecting wrong version. ------------------------------------------------------------------------ The remainder of the comments for this report are too long. To view the rest of the comments, please view the bug report online at http://bugs.php.net/17757 -- Edit this bug report at http://bugs.php.net/?id=17757&edit=1

« previous php.bugs (#11474) next »