#23536 [Fbk->Opn]: make: *** [libs/libphp4.bundle] Error 1

From: Date: Wed, 14 May 2003 18:51:38 +0000
Subject: #23536 [Fbk->Opn]: make: *** [libs/libphp4.bundle] Error 1
References: 1  Groups: php.bugs 
Request: Send a blank email to php-bugs+get-39660@lists.php.net to get a copy of this message
 ID:               23536
 Updated by:       kalowsky@php.net
 Reported By:      brianlee at ica dot net
-Status:           Feedback
+Status:           Open
 Bug Type:         Compile Failure
 Operating System: Mac OS X 10.2.6
 PHP Version:      4.3.2RC2
 New Comment:

leaving marked open.

compiler is standard issue apple distro.  Although version 1161 works
fine on my system here locally.  I'll try to look into it in another
week or so...


Previous Comments:
------------------------------------------------------------------------

[2003-05-14 10:58:25] sniper@php.net

Nevermind, I had same compiler and it works fine.
Can you try this configure line:

# rm config.cache && ./configure --disable-all --disable-cgi



------------------------------------------------------------------------

[2003-05-14 10:48:26] sniper@php.net

Could it be anyway possible for you to try some more stable version of
gcc? Like some version starting with 3.2...


------------------------------------------------------------------------

[2003-05-13 21:05:55] brianlee at ica dot net

Apple Computer, Inc. GCC version 1175, based on gcc version 3.1
20020420 (prerelease)

------------------------------------------------------------------------

[2003-05-13 20:01:47] sniper@php.net

Can not reproduce..what compiler is this happening with?


------------------------------------------------------------------------

[2003-05-07 18:47:03] brianlee at ica dot net

1. Download PHP 4.3.2RC2
2. Uncompress
3. run configure witht he following flags

./configure --with-xml --with-zlib --with-gd=/usr/local
--with-jpeg-dir=/usr/local --with-png-dir=/usr/local
--with-apxs=/usr/sbin/apxs --with-pgsql

4. Configure completes no problems no errors
5. make
7. I see this every so often...
cc1: warning: changing search order for system directory
"/usr/local/include"
cc1: warning:   as it has already been specified as a non-system
directory
6. make: *** [libs/libphp4.bundle] Error 1


------------------------------------------------------------------------


-- 
Edit this bug report at http://bugs.php.net/?id=23536&edit=1



Thread (10 messages)

« previous php.bugs (#39660) next »