RE: PHP 4.0 Bug #6397 Updated: Cannot start Apache due to _dl_default_scope

From: Date: Thu, 09 Nov 2000 09:24:06 +0000
Subject: RE: PHP 4.0 Bug #6397 Updated: Cannot start Apache due to _dl_default_scope
Groups: php.dev 
Request: Send a blank email to php-dev+get-37505@lists.php.net to get a copy of this message
Hi Sniper, OK we got this one fixed by basically dropping out some of the other modules and recompiling. There appeared to be some sort of conflict going on. This ones a bit old now and I can't remeber which ones we dropped. I'll try and double check to find out how we finally did manage to fix this problem. Cheers Mike ==================================================== http://www.ishop.co.uk/ Build a shop on-line. Buy online. ==================================================== Michael Parkinson BSc.(Hons) Technical Director Intellnet Limited Heath House 51 Dane Street Bishops Stortford. Hertfordshire CM23 3BT Phone : 01279 602800 DDI : 01279 602805 Fax : 01279 600815 Mobile : 0370 380511 E-mail : michael@intellnet.net.uk ICQ : 47666166 URL : http://www.intellnet.net.uk/ http://www.ishop.co.uk/ -----Original Message----- From: Bug Database [SMTP:php-dev@lists.php.net] Sent: Thursday, November 09, 2000 2:23 AM To: michael@intellnet.net.uk Subject: PHP 4.0 Bug #6397 Updated: Cannot start Apache due to _dl_default_scope ID: 6397 Updated by: sniper Reported By: michael@intellnet.net.uk Status: Feedback Bug Type: *General Issues Assigned To: Comments: Have you tried recompiling Apache and making sure I really supports DSO? --Jani Previous Comments: --------------------------------------------------------------------------- [2000-08-28 07:52:23] michael@intellnet.net.uk Compiling php as a loadable module: ./configure --with-mysql --with-apxs System compiles fine. When attempting to re-start apache with the new module: Cannot load /usr/lib/apache/1.3/libphp4.so into server: /usr/lib/apache/1.3/libphp4.so: undefined symbol: _dl_default_scope. As static, php compiles fine but apache compile drops out : /usr/lib/libdl.a(dlsym.o): In function `doit.2': dlsym.o(.text+0x22): undefined reference to `_dl_default_scope' dlsym.o(.text+0x4c): undefined reference to `_dl_default_scope' make[2]: *** [target_static] Error 1 make[2]: Leaving directory `/usr/apache_1.3.12/src' make[1]: *** [build-std] Error 2 make[1]: Leaving directory `/usr/apache_1.3.12' make: *** [build] Error 2 Bit stumped, even tried previous versions of php4 to no avail. With thanks Michael --------------------------------------------------------------------------- Full Bug description available at: http://bugs.php.net/?id=6397

« previous php.dev (#37505) next »