Re: PHP 4.0 Bug #7740 Updated: Will not compile properly

From: Date: Fri, 10 Nov 2000 15:48:17 +0000
Subject: Re: PHP 4.0 Bug #7740 Updated: Will not compile properly
References: 1  Groups: php.dev 
Request: Send a blank email to php-dev+get-37694@lists.php.net to get a copy of this message
On 10-11-00 15:29, "sniper@php.net" <sniper@php.net> wrote: > ID: 7740 > Updated by: sniper > Reported By: morten@ronseth.net > Status: Feedback > Bug Type: Compile Failure > Assigned To: > Comments: > > Please try latest snapshot from http://snaps.php.net > as there have been some MacOS related (AFAIK) fixes > recently. > > --Jani Latest from snaps.php.net compiles under MacOS X PB (Darwin 1.2) & MacOS X Server 1.2 (Rhapsody 5.6), but does not install. Halts with the following: /usr/local/src/php4-200011100645/build/shtool install -c -m 755 /usr/local/src/php4-200011100645/pear/phpextdist /usr/local/ bin/phpextdist for prog in phpize php-config pear; do \ /usr/local/src/php4-200011100645/build/shtool install -c -m 755 $prog /usr/local/bin/$prog; \ done cp: pear is a directory (not copied). make[2]: *** [install-programs] Error 1 make[1]: *** [install-recursive] Error 1 make: *** [install-recursive] Error 1 Cheers, -Morten --------------------------------------------------------------- Rayon Interaktiv AS http://www.rayon.no Morten Lerskau Rønseth mailto:morten.ronseth@rayon.no Karenslyst Allé 16d Tlf.: (47) 2254 1820 0278 Oslo Fax : (47) 2254 1821 Norway Mob.: (47) 9343 4357 ICQ : 25163080

« previous php.dev (#37694) next »