Bug #14034: Error compile on Solaris 2.7 on SUN E4500
| From: | tps at glo dot or dot th | Date: | Mon, 12 Nov 2001 15:52:56 +0000 |
| Subject: | Bug #14034: Error compile on Solaris 2.7 on SUN E4500 | ||
| Groups: | php.dev | ||
| Request: | Send a blank email to php-dev+get-70251@lists.php.net to get a copy of this message | ||
From: tps@glo.or.th
Operating system: Solaris 2.7 on SUN E4500
PHP version: 4.0.6
PHP Bug Type: Compile Failure
Bug description: Error compile on Solaris 2.7 on SUN E4500
# make
Making all in Zend
make[1]: Entering directory `/tmp/php-4.0.6/Zend'
/bin/sh ../libtool --silent --mode=compile gcc -DHAVE_CONFIG_H -I. -I.
-I../main
-D_POSIX_PTHREAD_SEMANTICS -DSUPPORT_UTF8 -DXML_BYTE_ORDER=21 -g -O2 -c
zend
_language_scanner.c
/usr/ccs/bin/as: "/var/tmp/cclaKd3o.s", line 29487: error: unknown opcode
".subs
ection"
/usr/ccs/bin/as: "/var/tmp/cclaKd3o.s", line 29487: error: statement
syntax
/usr/ccs/bin/as: "/var/tmp/cclaKd3o.s", line 29645: error: unknown opcode
".prev
ious"
/usr/ccs/bin/as: "/var/tmp/cclaKd3o.s", line 29645: error: statement
syntax
make[1]: *** [zend_language_scanner.lo] Error 1
make[1]: Leaving directory `/tmp/php-4.0.6/Zend'
make: *** [all-recursive] Error 1
--
Edit bug report at: http://bugs.php.net/?id=14034&edit=1