Bug #14034 Updated: Error compile on Solaris 2.7 on SUN E4500

From: Date: Mon, 12 Nov 2001 16:06:02 +0000
Subject: Bug #14034 Updated: Error compile on Solaris 2.7 on SUN E4500
References: 1  Groups: php.dev 
Request: Send a blank email to php-dev+get-70253@lists.php.net to get a copy of this message
ID: 14034 Updated by: derick Reported By: tps@glo.or.th Old Status: Open Status: Feedback Bug Type: Compile Failure Operating System: Solaris 2.7 on SUN E4500 PHP Version: 4.0.6 New Comment: Can you possible try the gnu utils for this to see? (www.sunfreeware.com) check for the binutils package. I'll try to reproduce it later today (solaris 8 on intel). Derick Previous Comments: ------------------------------------------------------------------------ [2001-11-12 10:52:55] tps@glo.or.th # make Making all in Zend make[1]: Entering directory `/tmp/php-4.0.6/Zend' /bin/sh ../libtool --silent --mode=compile gcc -DHAVE_CONFIG_H -I. -I. -I../main -D_POSIX_PTHREAD_SEMANTICS -DSUPPORT_UTF8 -DXML_BYTE_ORDER=21 -g -O2 -c zend _language_scanner.c /usr/ccs/bin/as: "/var/tmp/cclaKd3o.s", line 29487: error: unknown opcode ".subs ection" /usr/ccs/bin/as: "/var/tmp/cclaKd3o.s", line 29487: error: statement syntax /usr/ccs/bin/as: "/var/tmp/cclaKd3o.s", line 29645: error: unknown opcode ".prev ious" /usr/ccs/bin/as: "/var/tmp/cclaKd3o.s", line 29645: error: statement syntax make[1]: *** [zend_language_scanner.lo] Error 1 make[1]: Leaving directory `/tmp/php-4.0.6/Zend' make: *** [all-recursive] Error 1 ------------------------------------------------------------------------ Edit this bug report at http://bugs.php.net/?id=14034&edit=1

« previous php.dev (#70253) next »