Re: Bug #14034 Updated: Error compile on Solaris 2.7 on SUN E4500

From: Date: Wed, 14 Nov 2001 01:37:12 +0000
Subject: Re: Bug #14034 Updated: Error compile on Solaris 2.7 on SUN E4500
Groups: php.dev 
Request: Send a blank email to php-dev+get-70393@lists.php.net to get a copy of this message
Dear Sir Thank you very much. And now I have already installed by your advise. -----Original Message----- From: Bug Database <php-dev@lists.php.net> To: tps@glo.or.th <tps@glo.or.th> Date: 12 พฤศจิกายน 2544 23:04 Subject: Bug #14034 Updated: Error compile on Solaris 2.7 on SUN E4500 > > >ATTENTION! Do NOT reply to this email! >To reply, use the web interface found at http://bugs.php.net/?id=14034&edit=2 > > >ID: 14034 >Updated by: derick >Reported By: tps@glo.or.th >Old Status: Open >Status: Feedback >Bug Type: Compile Failure >Operating System: Solaris 2.7 on SUN E4500 >PHP Version: 4.0.6 >New Comment: > >Can you possible try the gnu utils for this to see? (www.sunfreeware.com) check for the binutils package. > >I'll try to reproduce it later today (solaris 8 on intel). > >Derick > >Previous Comments: >------------------------------------------------------------------------ > >[2001-11-12 10:52:55] tps@glo.or.th > ># make >Making all in Zend >make[1]: Entering directory `/tmp/php-4.0.6/Zend' >/bin/sh ../libtool --silent --mode=compile gcc -DHAVE_CONFIG_H -I. -I. -I../main > -D_POSIX_PTHREAD_SEMANTICS -DSUPPORT_UTF8 -DXML_BYTE_ORDER=21 -g -O2 -c zend >_language_scanner.c >/usr/ccs/bin/as: "/var/tmp/cclaKd3o.s", line 29487: error: unknown opcode ".subs >ection" >/usr/ccs/bin/as: "/var/tmp/cclaKd3o.s", line 29487: error: statement syntax >/usr/ccs/bin/as: "/var/tmp/cclaKd3o.s", line 29645: error: unknown opcode ".prev >ious" >/usr/ccs/bin/as: "/var/tmp/cclaKd3o.s", line 29645: error: statement syntax >make[1]: *** [zend_language_scanner.lo] Error 1 >make[1]: Leaving directory `/tmp/php-4.0.6/Zend' >make: *** [all-recursive] Error 1 > >------------------------------------------------------------------------ > > >

« previous php.dev (#70393) next »