Re: php-gtk2 compilation error

From: Date: Mon, 12 Dec 2005 20:51:24 +0000
Subject: Re: php-gtk2 compilation error
References: 1  Groups: php.gtk.dev 
Request: Send a blank email to php-gtk-dev+get-2106@lists.php.net to get a copy of this message
isoTop Top escreveu: > the error: > /home/isotop/php-gtk/php-gtk/main/phpg_support.c: In function > `phpg_init_object': > /home/isotop/php-gtk/php-gtk/main/phpg_support.c:246: error: structure has > no member named `guards' > make: *** [main/phpg_support.lo] Error 1 > Very similar thing here: /home/jp/Downloads/php/php-gtk/main/phpg_support.c: In function 'phpg_init_object': /home/jp/Downloads/php/php-gtk/main/phpg_support.c:246: error: 'zend_object' has no member named 'guards' make: *** [main/phpg_support.lo] Error 1 If more information is needed, just yell ;)

Attachment: [application/pgp-signature] OpenPGP digital signature signature.asc
« previous php.gtk.dev (#2106) next »