Re: php-gtk2 compilation error

From: Date: Mon, 12 Dec 2005 21:33:48 +0000
Subject: Re: php-gtk2 compilation error
References: 1 2  Groups: php.gtk.dev 
Request: Send a blank email to php-gtk-dev+get-2107@lists.php.net to get a copy of this message
forgot to give some more info, im on gentoo 64bit. On 12/12/05, Jp <jp@jp-corner.uni.cc> wrote: > > isoTop Top escreveu: > > the error: > > /home/isotop/php-gtk/php-gtk/main/phpg_support.c: In function > > `phpg_init_object': > > /home/isotop/php-gtk/php-gtk/main/phpg_support.c:246: error: structure > has > > no member named `guards' > > make: *** [main/phpg_support.lo] Error 1 > > > > Very similar thing here: > > /home/jp/Downloads/php/php-gtk/main/phpg_support.c: In function > 'phpg_init_object': > /home/jp/Downloads/php/php-gtk/main/phpg_support.c:246: error: > 'zend_object' has no member named 'guards' > make: *** [main/phpg_support.lo] Error 1 > > If more information is needed, just yell ;) > > >

« previous php.gtk.dev (#2107) next »