Re: php-gtk2 compilation error
| From: | Andrei Zmievski | Date: | Tue, 13 Dec 2005 00:58:45 +0000 |
| Subject: | Re: php-gtk2 compilation error | ||
| References: | 1 2 3 | Groups: | php.gtk.dev |
| Request: | Send a blank email to php-gtk-dev+get-2108@lists.php.net to get a copy of this message | ||
You need to compile against PHP 5.1.1.
-Andrei
On Dec 12, 2005, at 1:33 PM, isoTop Top wrote:
forgot to give some more info, im on gentoo 64bit. On 12/12/05, Jp <jp@jp-corner.uni.cc> wrote:isoTop Top escreveu:the error: /home/isotop/php-gtk/php-gtk/main/phpg_support.c: In function `phpg_init_object': /home/isotop/php-gtk/php-gtk/main/phpg_support.c:246: error: structurehasno member named `guards' make: *** [main/phpg_support.lo] Error 1Very similar thing here: /home/jp/Downloads/php/php-gtk/main/phpg_support.c: In function 'phpg_init_object': /home/jp/Downloads/php/php-gtk/main/phpg_support.c:246: error: 'zend_object' has no member named 'guards' make: *** [main/phpg_support.lo] Error 1 If more information is needed, just yell ;)