php.qa.reports

« previous php.qa.reports (33969-33989 of 34008) next »
# subject author date lines
33969 PHP 7.2.0alpha1 make test report Thu, 08 Jun 2017 14:56:48 +0000 1532
33970 Error report generated in make test (php-7.1.6) Wed, 14 Jun 2017 15:34:03 +0000 1792
33971 TEST SUMMARY Wed, 05 Jul 2017 16:20:22 +0000 1444
33972 Attached php test results for make-test on 7.1.6 Thu, 06 Jul 2017 20:28:31 +0000 837
33973 FAILED TEST SUMMARY Wed, 26 Jul 2017 04:38:25 +0000 1073
33974 PHP 7.1.7 FAILED TEST SUMMARY REPORT Wed, 26 Jul 2017 14:51:24 +0000 1074
33975 5.6.31 // make test on debian 9.1 x86-64 Tue, 29 Aug 2017 19:50:20 +0000 882
33976 php_test_results_20170831_1639 Thu, 31 Aug 2017 16:55:57 +0000 841
33977 Report Wed, 27 Sep 2017 20:04:00 +0000 727
33978 php report Thu, 09 Nov 2017 01:55:19 +0000 3684
33979 RE: You may have found a problem in PHP. Fri, 17 Nov 2017 17:35:50 +0000 849
33980 Make Test Report Fri, 24 Nov 2017 20:30:33 +0000 21
33981 oci8 test failed with php 7.1.13 Wed, 10 Jan 2018 08:18:08 +0000 849
33982 acpu 5.1.9 make test problem report Fri, 12 Jan 2018 10:28:45 +0000 2683
33983 php report Tue, 16 Jan 2018 09:40:46 +0000 3663
33984 FAILED TEST Tue, 23 Jan 2018 15:08:23 +0000 4724
33985 php-5.6.34.tar.gz make test results Thu, 22 Mar 2018 13:59:48 +0000 742
33986 make test results | php 7.2.4 built on macos 10.13.3 Thu, 29 Mar 2018 15:17:18 +0000 1855
33987 "ext/calendar/unixtojd_error1.phpt" test fails Thu, 19 Apr 2018 02:23:47 +0000 2175
33988 Make test of php results Fri, 20 Apr 2018 04:17:30 +0000 4296
« previous php.qa.reports (33969-33989 of 34008) next »